id_mutation,date_mutation,numero_disposition,nature_mutation,valeur_fonciere,adresse_numero,adresse_suffixe,adresse_nom_voie,adresse_code_voie,code_postal,code_commune,nom_commune,code_departement,ancien_code_commune,ancien_nom_commune,id_parcelle,ancien_id_parcelle,numero_volume,lot1_numero,lot1_surface_carrez,lot2_numero,lot2_surface_carrez,lot3_numero,lot3_surface_carrez,lot4_numero,lot4_surface_carrez,lot5_numero,lot5_surface_carrez,nombre_lots,code_type_local,type_local,surface_reelle_bati,nombre_pieces_principales,code_nature_culture,nature_culture,code_nature_culture_speciale,nature_culture_speciale,surface_terrain,longitude,latitude
2019-1119441,2019-01-17,000001,Vente,42500,5078,,LE PLAIN CHAMPS,B010,76570,76234,Émanville,76,,,76234000AH0243,,,,,,,,,,,,,0,1,Maison,77,3,S,sols,,,809,0.967361,49.617374
2019-1120031,2019-03-15,000001,Vente,180000,200,,RUE DE LA CROIX DE BUIS,0090,76570,76234,Émanville,76,,,76234000AE0224,,,,,,,,,,,,,0,1,Maison,86,4,S,sols,,,600,0.962595,49.620971
2019-1120182,2019-03-28,000001,Vente,183500,23,,IMP DU CHAMP DES OISEAUX,0070,76570,76234,Émanville,76,,,76234000AD0210,,,,,,,,,,,,,0,1,Maison,102,5,S,sols,,,500,0.960929,49.62347
2019-1120182,2019-03-28,000001,Vente,183500,23,,IMP DU CHAMP DES OISEAUX,0070,76570,76234,Émanville,76,,,76234000AD0210,,,,,,,,,,,,,0,1,Maison,102,5,J,jardins,,,302,0.960929,49.62347
2019-1120541,2019-04-18,000001,Vente,247000,5001,,HAMEAU DE CALLEVILLE,B002,76570,76234,Émanville,76,,,76234000AB0186,,,,,,,,,,,,,0,1,Maison,127,5,VE,vergers,,,5635,0.954899,49.63143
2019-1120541,2019-04-18,000001,Vente,247000,5001,,HAMEAU DE CALLEVILLE,B002,76570,76234,Émanville,76,,,76234000AB0186,,,,,,,,,,,,,0,1,Maison,127,5,S,sols,,,696,0.954899,49.63143
2019-1120681,2019-05-06,000001,Vente,260000,87,,CHE DE LA PRAIRIE,0195,76570,76234,Émanville,76,,,76234000AH0211,,,,,,,,,,,,,0,1,Maison,156,6,T,terres,,,2606,0.968215,49.617117
2019-1120839,2019-05-17,000001,Vente,87800,123,,IMP DES FRESNES,0105,76570,76234,Émanville,76,,,76234000AD0239,,,,,,,,,,,,,0,1,Maison,110,3,S,sols,,,1000,0.962019,49.622653
2019-1121256,2019-06-27,000001,Vente,188000,83,,IMP DU CHAMP DES OISEAUX,0070,76570,76234,Émanville,76,,,76234000AD0213,,,,,,,,,,,,,0,1,Maison,100,5,J,jardins,,,524,0.96149,49.623733
2019-1121256,2019-06-27,000001,Vente,188000,83,,IMP DU CHAMP DES OISEAUX,0070,76570,76234,Émanville,76,,,76234000AD0213,,,,,,,,,,,,,0,1,Maison,100,5,S,sols,,,500,0.96149,49.623733
2019-1121593,2019-07-26,000001,Vente,80000,5038,,VILLAGE D EMANVILLE NORD,B008,76570,76234,Émanville,76,,,76234000AD0254,,,,,,,,,,,,,0,1,Maison,102,6,S,sols,,,951,0.960377,49.623075
2019-1121806,2019-07-30,000001,Vente,187500,5050,A,HAMEAU DES EPLUQUES,B003,76570,76234,Émanville,76,,,76234000AC0121,,,,,,,,,,,,,0,1,Maison,106,5,VE,vergers,,,1300,0.941525,49.627003
2019-1122396,2019-09-27,000001,Vente,3000,,,HAMEAU DES EPLUQUES,B003,76570,76234,Émanville,76,,,76234000AC0067,,,,,,,,,,,,,0,,,,,P,prés,,,2950,0.949276,49.624794
2019-1122418,2019-09-16,000001,Vente,179500,5104,,VILLAGE D EMANVILLE NORD,B008,76570,76234,Émanville,76,,,76234000AD0261,,,,,,,,,,,,,0,1,Maison,127,4,S,sols,,,500,0.960583,49.621741
2019-1122418,2019-09-16,000001,Vente,179500,5104,,VILLAGE D EMANVILLE NORD,B008,76570,76234,Émanville,76,,,76234000AD0261,,,,,,,,,,,,,0,1,Maison,127,4,J,jardins,,,230,0.960583,49.621741
2019-1122451,2019-09-09,000001,Vente,205500,5051,,HAMEAU DES EPLUQUES,B003,76570,76234,Émanville,76,,,76234000AC0182,,,,,,,,,,,,,0,1,Maison,68,2,S,sols,,,500,0.939539,49.626947
2019-1122451,2019-09-09,000001,Vente,205500,5051,,HAMEAU DES EPLUQUES,B003,76570,76234,Émanville,76,,,76234000AC0182,,,,,,,,,,,,,0,1,Maison,68,2,VE,vergers,,,6410,0.939539,49.626947
2019-1122714,2019-10-01,000001,Vente,193000,123,,RUE DE LA CROIX DE BUIS,0090,76570,76234,Émanville,76,,,76234000AD0222,,,,,,,,,,,,,0,1,Maison,95,4,S,sols,,,990,0.961517,49.62172
2019-1123063,2019-10-31,000001,Vente,226100,664,,RUE DE LA CROIX DE BUIS,0090,76570,76234,Émanville,76,,,76234000AH0087,,,,,,,,,,,,,0,1,Maison,75,2,P,prés,,,9112,0.96806,49.619408
2019-1123063,2019-10-31,000001,Vente,226100,,,LA RECRUE,B007,76570,76234,Émanville,76,,,76234000AH0274,,,,,,,,,,,,,0,,,,,P,prés,,,1089,0.968792,49.618996
2019-1123063,2019-10-31,000001,Vente,226100,,,LA RECRUE,B007,76570,76234,Émanville,76,,,76234000AH0277,,,,,,,,,,,,,0,,,,,AB,terrains a bâtir,,,1369,0.968943,49.619466
2019-1123264,2019-11-21,000001,Vente,332,,,VILLAGE D EMANVILLE SUD,B009,76570,76234,Émanville,76,,,76234000AE0261,,,,,,,,,,,,,0,,,,,AB,terrains a bâtir,,,80,0.961346,49.619429
2019-1123264,2019-11-21,000001,Vente,332,,,VILLAGE D EMANVILLE SUD,B009,76570,76234,Émanville,76,,,76234000AE0262,,,,,,,,,,,,,0,,,,,AB,terrains a bâtir,,,126,0.961811,49.619917
2019-1123264,2019-11-21,000001,Vente,332,,,VILLAGE D EMANVILLE SUD,B009,76570,76234,Émanville,76,,,76234000AE0264,,,,,,,,,,,,,0,,,,,AB,terrains a bâtir,,,126,0.961534,49.619634
2019-1123425,2019-12-02,000001,Vente,214000,34,,IMP TOUS VENTS,0500,76570,76234,Émanville,76,,,76234000AE0211,,,,,,,,,,,,,0,1,Maison,108,4,S,sols,,,820,0.956448,49.622064
