id_mutation,date_mutation,numero_disposition,nature_mutation,valeur_fonciere,adresse_numero,adresse_suffixe,adresse_nom_voie,adresse_code_voie,code_postal,code_commune,nom_commune,code_departement,ancien_code_commune,ancien_nom_commune,id_parcelle,ancien_id_parcelle,numero_volume,lot1_numero,lot1_surface_carrez,lot2_numero,lot2_surface_carrez,lot3_numero,lot3_surface_carrez,lot4_numero,lot4_surface_carrez,lot5_numero,lot5_surface_carrez,nombre_lots,code_type_local,type_local,surface_reelle_bati,nombre_pieces_principales,code_nature_culture,nature_culture,code_nature_culture_speciale,nature_culture_speciale,surface_terrain,longitude,latitude
2019-1134435,2019-01-23,000001,Vente,152000,5086,,MESNIL DAVID HAMEAU,B013,76390,76372,Illois,76,,,763720000A0237,,,,,,,,,,,,,0,1,Maison,75,4,S,sols,,,252,1.613719,49.755334
2019-1134435,2019-01-23,000001,Vente,152000,5086,,MESNIL DAVID HAMEAU,B013,76390,76372,Illois,76,,,763720000A0237,,,,,,,,,,,,,0,1,Maison,75,4,VE,vergers,,,1698,1.613719,49.755334
2019-1134734,2019-04-16,000001,Vente,450,,,LE MONT GODART,B014,76390,76372,Illois,76,,,76372000ZP0030,,,,,,,,,,,,,0,,,,,T,terres,,,450,1.649503,49.739314
2019-1134735,2019-04-16,000002,Vente,15000,,,LE CHEMIN VERT,B005,76390,76372,Illois,76,,,76372000ZR0025,,,,,,,,,,,,,0,,,,,T,terres,,,19240,1.641673,49.7418
2019-1134736,2019-05-13,000001,Vente,122500,7,,RUE DU CHATEAU,0035,76390,76372,Illois,76,,,763720000D0290,,,,,,,,,,,,,0,1,Maison,120,6,S,sols,,,1464,1.667602,49.741697
2019-1134752,2019-04-30,000001,Vente,132000,18,B,MESNIL DAVID HAMEAU,B013,76390,76372,Illois,76,,,76372000ZE0022,,,,,,,,,,,,,0,1,Maison,99,4,S,sols,,,500,1.617051,49.755015
2019-1134752,2019-04-30,000001,Vente,132000,18,B,MESNIL DAVID HAMEAU,B013,76390,76372,Illois,76,,,76372000ZE0022,,,,,,,,,,,,,0,1,Maison,99,4,P,prés,,,1671,1.617051,49.755015
2019-1134752,2019-04-30,000001,Vente,132000,18,B,MESNIL DAVID HAMEAU,B013,76390,76372,Illois,76,,,76372000ZE0022,,,,,,,,,,,,,0,1,Maison,99,4,P,prés,,,3365,1.617051,49.755015
2019-1134963,2019-06-18,000001,Vente,145000,,,CUIGNET,B007,76390,76372,Illois,76,,,763720000B0158,,,,,,,,,,,,,0,,,,,J,jardins,,,625,1.652713,49.754577
2019-1134963,2019-06-18,000001,Vente,145000,5042,,CUIGNET,B007,76390,76372,Illois,76,,,763720000B0302,,,,,,,,,,,,,0,1,Maison,217,5,S,sols,,,1431,1.653365,49.754615
2019-1134963,2019-06-18,000001,Vente,145000,,,CUIGNET,B007,76390,76372,Illois,76,,,763720000B0308,,,,,,,,,,,,,0,,,,,S,sols,,,38,1.65361,49.754787
2019-1134963,2019-06-18,000001,Vente,145000,,,CUIGNET,B007,76390,76372,Illois,76,,,763720000B0309,,,,,,,,,,,,,0,,,,,S,sols,,,40,1.653721,49.754609
2019-1134963,2019-06-18,000001,Vente,145000,3,,CUIGNET,B007,76390,76372,Illois,76,,,763720000B0327,,,,,,,,,,,,,0,3,Dépendance,,0,VE,vergers,,,1407,1.653445,49.754629
2019-1134963,2019-06-18,000001,Vente,145000,3,,CUIGNET,B007,76390,76372,Illois,76,,,763720000B0327,,,,,,,,,,,,,0,3,Dépendance,,0,S,sols,,,1834,1.653445,49.754629
2019-1134963,2019-06-18,000001,Vente,145000,3,,CUIGNET,B007,76390,76372,Illois,76,,,763720000B0327,,,,,,,,,,,,,0,3,Dépendance,,0,VE,vergers,,,1407,1.653445,49.754629
2019-1134963,2019-06-18,000001,Vente,145000,3,,CUIGNET,B007,76390,76372,Illois,76,,,763720000B0327,,,,,,,,,,,,,0,3,Dépendance,,0,VE,vergers,,,1407,1.653445,49.754629
2019-1134963,2019-06-18,000001,Vente,145000,3,,CUIGNET,B007,76390,76372,Illois,76,,,763720000B0327,,,,,,,,,,,,,0,3,Dépendance,,0,VE,vergers,,,1407,1.653445,49.754629
2019-1134963,2019-06-18,000001,Vente,145000,3,,CUIGNET,B007,76390,76372,Illois,76,,,763720000B0327,,,,,,,,,,,,,0,3,Dépendance,,0,VE,vergers,,,1407,1.653445,49.754629
2019-1134963,2019-06-18,000001,Vente,145000,3,,CUIGNET,B007,76390,76372,Illois,76,,,763720000B0327,,,,,,,,,,,,,0,3,Dépendance,,0,S,sols,,,1834,1.653445,49.754629
2019-1134963,2019-06-18,000001,Vente,145000,3,,CUIGNET,B007,76390,76372,Illois,76,,,763720000B0327,,,,,,,,,,,,,0,3,Dépendance,,0,S,sols,,,1834,1.653445,49.754629
2019-1134963,2019-06-18,000001,Vente,145000,3,,CUIGNET,B007,76390,76372,Illois,76,,,763720000B0327,,,,,,,,,,,,,0,3,Dépendance,,0,S,sols,,,1834,1.653445,49.754629
2019-1134963,2019-06-18,000001,Vente,145000,3,,CUIGNET,B007,76390,76372,Illois,76,,,763720000B0327,,,,,,,,,,,,,0,3,Dépendance,,0,S,sols,,,1834,1.653445,49.754629
2019-1135145,2019-08-02,000001,Vente,135000,5109,,COUPIGNY,B006,76390,76372,Illois,76,,,763720000D0284,,,,,,,,,,,,,0,1,Maison,112,4,VE,vergers,,,3882,1.668308,49.743334
2019-1135145,2019-08-02,000001,Vente,135000,5109,,COUPIGNY,B006,76390,76372,Illois,76,,,763720000D0284,,,,,,,,,,,,,0,1,Maison,112,4,S,sols,,,500,1.668308,49.743334
2019-1135606,2019-11-27,000001,Vente,60000,,,LA FOLIE,B008,76390,76372,Illois,76,,,76372000ZL0044,,,,,,,,,,,,,0,,,,,P,prés,,,2600,1.655247,49.747109
2019-1135606,2019-11-27,000001,Vente,60000,,,LA FOLIE,B008,76390,76372,Illois,76,,,76372000ZL0044,,,,,,,,,,,,,0,,,,,T,terres,,,5400,1.655247,49.747109
2019-1135622,2019-11-28,000001,Vente,10632,,,BOIS DE CUIGNET,B001,76390,76372,Illois,76,,,763720000B0096,,,,,,,,,,,,,0,,,,,BT,taillis simples,,,812,1.652397,49.757387
2019-1135622,2019-11-28,000001,Vente,10632,,,BOIS DE CUIGNET,B001,76390,76372,Illois,76,,,763720000B0097,,,,,,,,,,,,,0,,,,,BT,taillis simples,,,3139,1.651593,49.757913
2019-1135622,2019-11-28,000001,Vente,10632,,,BOIS DE CUIGNET,B001,76390,76372,Illois,76,,,763720000B0102,,,,,,,,,,,,,0,,,,,BT,taillis simples,,,959,1.65246,49.758631
2019-1135622,2019-11-28,000001,Vente,10632,,,BOIS DE CUIGNET,B001,76390,76372,Illois,76,,,763720000B0103,,,,,,,,,,,,,0,,,,,BT,taillis simples,,,399,1.653223,49.757866
2019-1135622,2019-11-28,000001,Vente,10632,,,BOIS DE CUIGNET,B001,76390,76372,Illois,76,,,763720000B0209,,,,,,,,,,,,,0,,,,,BT,taillis simples,,,558,1.652551,49.757512
2019-1135622,2019-11-28,000001,Vente,10632,,,BOIS DE CUIGNET,B001,76390,76372,Illois,76,,,763720000B0210,,,,,,,,,,,,,0,,,,,BT,taillis simples,,,1831,1.651864,49.757978
2019-1135631,2019-11-23,000001,Vente,70000,,,LE MENIVIER,B012,76390,76372,Illois,76,,,763720000D0221,,,,,,,,,,,,,0,,,,,J,jardins,,,1436,1.692527,49.741103
2019-1135631,2019-11-23,000001,Vente,70000,,,LE MENIVIER,B012,76390,76372,Illois,76,,,763720000D0221,,,,,,,,,,,,,0,,,,,S,sols,,,119,1.692527,49.741103
2019-1135631,2019-11-23,000001,Vente,70000,5163,,LE MENIVIER,B012,76390,76372,Illois,76,,,763720000D0222,,,,,,,,,,,,,0,1,Maison,128,5,S,sols,,,333,1.69267,49.741043
2019-1135724,2019-12-16,000001,Vente,40000,5015,A,MESNIL DAVID HAMEAU,B013,76390,76372,Illois,76,,,763720000A0356,,,,,,,,,,,,,0,1,Maison,250,7,S,sols,,,500,1.620161,49.756404
2019-1135724,2019-12-16,000001,Vente,40000,5015,A,MESNIL DAVID HAMEAU,B013,76390,76372,Illois,76,,,763720000A0356,,,,,,,,,,,,,0,1,Maison,250,7,VE,vergers,,,1620,1.620161,49.756404
