id_mutation,date_mutation,numero_disposition,nature_mutation,valeur_fonciere,adresse_numero,adresse_suffixe,adresse_nom_voie,adresse_code_voie,code_postal,code_commune,nom_commune,code_departement,ancien_code_commune,ancien_nom_commune,id_parcelle,ancien_id_parcelle,numero_volume,lot1_numero,lot1_surface_carrez,lot2_numero,lot2_surface_carrez,lot3_numero,lot3_surface_carrez,lot4_numero,lot4_surface_carrez,lot5_numero,lot5_surface_carrez,nombre_lots,code_type_local,type_local,surface_reelle_bati,nombre_pieces_principales,code_nature_culture,nature_culture,code_nature_culture_speciale,nature_culture_speciale,surface_terrain,longitude,latitude
2019-1135027,2019-07-02,000001,Vente,330000,,,LE BOURG,B003,76390,76381,Landes-Vieilles-et-Neuves,76,,,763810000A0370,,,,,,,,,,,,,0,,,,,P,prés,,,69,1.624858,49.785636
2019-1135027,2019-07-02,000001,Vente,330000,5003,,LE BOURG,B003,76390,76381,Landes-Vieilles-et-Neuves,76,,,763810000A0372,,,,,,,,,,,,,0,1,Maison,190,9,S,sols,,,2318,1.624329,49.785856
2019-1135141,2019-07-29,000001,Vente,105000,5072,,PLAINE DE SAINTE BEUVE,B007,76390,76381,Landes-Vieilles-et-Neuves,76,,,763810000B0041,,,,,,,,,,,,,0,1,Maison,70,4,P,prés,,,1615,1.625481,49.781294
2019-1135141,2019-07-29,000001,Vente,105000,5072,,PLAINE DE SAINTE BEUVE,B007,76390,76381,Landes-Vieilles-et-Neuves,76,,,763810000B0041,,,,,,,,,,,,,0,1,Maison,70,4,S,sols,,,960,1.625481,49.781294
2019-1135489,2019-10-17,000001,Vente,60000,5051,,VIEILLES LANDES,B015,76390,76381,Landes-Vieilles-et-Neuves,76,,,763810000A0243,,,,,,,,,,,,,0,1,Maison,72,5,S,sols,,,1784,1.661705,49.790886
2019-1135489,2019-10-17,000001,Vente,60000,,,VIEILLES LANDES,B015,76390,76381,Landes-Vieilles-et-Neuves,76,,,763810000A0375,,,,,,,,,,,,,0,,,,,P,prés,,,9690,1.662134,49.791001
2019-1135489,2019-10-17,000001,Vente,60000,,,VIEILLES LANDES,B015,76390,76381,Landes-Vieilles-et-Neuves,76,,,763810000A0377,,,,,,,,,,,,,0,,,,,VE,vergers,,,937,1.661496,49.7914
2019-1135489,2019-10-17,000001,Vente,60000,,,VIEILLES LANDES,B015,76390,76381,Landes-Vieilles-et-Neuves,76,,,763810000A0379,,,,,,,,,,,,,0,,,,,J,jardins,,,244,1.6614,49.790802
2019-1135695,2019-12-19,000001,Vente,8000,,,VERT BOIS,B014,76390,76381,Landes-Vieilles-et-Neuves,76,,,76381000ZD0016,,,,,,,,,,,,,0,,,,,T,terres,,,8222,1.628024,49.781233
