id_mutation,date_mutation,numero_disposition,nature_mutation,valeur_fonciere,adresse_numero,adresse_suffixe,adresse_nom_voie,adresse_code_voie,code_postal,code_commune,nom_commune,code_departement,ancien_code_commune,ancien_nom_commune,id_parcelle,ancien_id_parcelle,numero_volume,lot1_numero,lot1_surface_carrez,lot2_numero,lot2_surface_carrez,lot3_numero,lot3_surface_carrez,lot4_numero,lot4_surface_carrez,lot5_numero,lot5_surface_carrez,nombre_lots,code_type_local,type_local,surface_reelle_bati,nombre_pieces_principales,code_nature_culture,nature_culture,code_nature_culture_speciale,nature_culture_speciale,surface_terrain,longitude,latitude
2019-1136215,2019-03-13,000001,Vente,186000,5,,IMP DU CHAMP D OISEL,0060,76190,76702,Touffreville-la-Corbeline,76,,,76702000AK0133,,,,,,,,,,,,,0,1,Maison,110,4,VE,vergers,CIDRE,Cidre,524,0.762451,49.578318
2019-1136215,2019-03-13,000001,Vente,186000,5,,IMP DU CHAMP D OISEL,0060,76190,76702,Touffreville-la-Corbeline,76,,,76702000AK0133,,,,,,,,,,,,,0,1,Maison,110,4,S,sols,,,500,0.762451,49.578318
2019-1136215,2019-03-13,000001,Vente,186000,,,LE BOURG NAUDIN,B006,76190,76702,Touffreville-la-Corbeline,76,,,76702000AK0142,,,,,,,,,,,,,0,,,,,S,sols,,,825,0.761473,49.578231
2019-1136262,2019-03-27,000001,Vente,440000,,,FERMES DE LA CHAUSSEE,B017,76190,76702,Touffreville-la-Corbeline,76,,,76702000AN0085,,,,,,,,,,,,,0,,,,,VE,vergers,CIDRE,Cidre,2925,0.739008,49.588391
2019-1136262,2019-03-27,000001,Vente,440000,288,,CHE DE LA FERME DE LA CHAUSSEE,0133,76190,76702,Touffreville-la-Corbeline,76,,,76702000AN0088,,,,,,,,,,,,,0,4,Local industriel. commercial ou assimilé,130,0,J,jardins,,,744,,
2019-1136262,2019-03-27,000001,Vente,440000,288,,CHE DE LA FERME DE LA CHAUSSEE,0133,76190,76702,Touffreville-la-Corbeline,76,,,76702000AN0088,,,,,,,,,,,,,0,1,Maison,240,9,VE,vergers,CIDRE,Cidre,39443,,
2019-1136262,2019-03-27,000001,Vente,440000,288,,CHE DE LA FERME DE LA CHAUSSEE,0133,76190,76702,Touffreville-la-Corbeline,76,,,76702000AN0088,,,,,,,,,,,,,0,4,Local industriel. commercial ou assimilé,130,0,VE,vergers,CIDRE,Cidre,39443,,
2019-1136262,2019-03-27,000001,Vente,440000,288,,CHE DE LA FERME DE LA CHAUSSEE,0133,76190,76702,Touffreville-la-Corbeline,76,,,76702000AN0088,,,,,,,,,,,,,0,1,Maison,240,9,J,jardins,,,744,,
2019-1136262,2019-03-27,000001,Vente,440000,288,,CHE DE LA FERME DE LA CHAUSSEE,0133,76190,76702,Touffreville-la-Corbeline,76,,,76702000AN0088,,,,,,,,,,,,,0,4,Local industriel. commercial ou assimilé,130,0,S,sols,,,839,,
2019-1136262,2019-03-27,000001,Vente,440000,288,,CHE DE LA FERME DE LA CHAUSSEE,0133,76190,76702,Touffreville-la-Corbeline,76,,,76702000AN0088,,,,,,,,,,,,,0,1,Maison,240,9,S,sols,,,839,,
2019-1136262,2019-03-27,000001,Vente,440000,210,,CHE DE LA FERME DE LA CHAUSSEE,0133,76190,76702,Touffreville-la-Corbeline,76,,,76702000AN0089,,,,,,,,,,,,,0,4,Local industriel. commercial ou assimilé,1100,0,P,prés,,,17404,,
2019-1136262,2019-03-27,000001,Vente,440000,210,,CHE DE LA FERME DE LA CHAUSSEE,0133,76190,76702,Touffreville-la-Corbeline,76,,,76702000AN0089,,,,,,,,,,,,,0,4,Local industriel. commercial ou assimilé,1000,0,S,sols,,,4000,,
2019-1136262,2019-03-27,000001,Vente,440000,210,,CHE DE LA FERME DE LA CHAUSSEE,0133,76190,76702,Touffreville-la-Corbeline,76,,,76702000AN0089,,,,,,,,,,,,,0,4,Local industriel. commercial ou assimilé,1100,0,S,sols,,,4000,,
2019-1136262,2019-03-27,000001,Vente,440000,210,,CHE DE LA FERME DE LA CHAUSSEE,0133,76190,76702,Touffreville-la-Corbeline,76,,,76702000AN0089,,,,,,,,,,,,,0,4,Local industriel. commercial ou assimilé,1000,0,P,prés,,,17404,,
2019-1136349,2019-04-04,000001,Vente,120500,14,,IMP DES PEUPLIERS,0207,76190,76702,Touffreville-la-Corbeline,76,,,76702000AK0213,,,,,,,,,,,,,0,1,Maison,76,4,S,sols,,,784,0.761553,49.57893
2019-1136349,2019-04-04,000001,Vente,120500,,,LE BOURG NAUDIN,B006,76190,76702,Touffreville-la-Corbeline,76,,,76702000AK0218,,,,,,,,,,,,,0,,,,,S,sols,,,39,0.761369,49.578978
2019-1136843,2019-07-19,000001,Vente,5600,,,TERRES DE LA CHAUSSEE,B032,76190,76702,Touffreville-la-Corbeline,76,,,76702000AL0019,,,,,,,,,,,,,0,,,,,P,prés,,,5648,0.740648,49.583158
2019-1136918,2019-07-17,000002,Vente,62085,,,LE BOURG,B004,76190,76702,Touffreville-la-Corbeline,76,,,76702000AH0402,,,,,,,,,,,,,0,,,,,VE,vergers,CIDRE,Cidre,1003,0.762338,49.58289
2019-1137096,2019-09-12,000001,Vente,22821,,,LE MAROC,B024,76190,76702,Touffreville-la-Corbeline,76,,,76702000AC0064,,,,,,,,,,,,,0,,,,,T,terres,,,2885,0.772882,49.589027
2019-1137096,2019-09-12,000001,Vente,22821,,,LE VERBOSC,B034,76190,76702,Touffreville-la-Corbeline,76,,,76702000AD0062,,,,,,,,,,,,,0,,,,,T,terres,,,5471,0.78486,49.583714
2019-1137096,2019-09-12,000001,Vente,22821,,,LE VERBOSC,B034,76190,76702,Touffreville-la-Corbeline,76,,,76702000AD0062,,,,,,,,,,,,,0,,,,,T,terres,,,5471,0.78486,49.583714
2019-1137096,2019-09-12,000001,Vente,22821,,,LE VERBOSC,B034,76190,76702,Touffreville-la-Corbeline,76,,,76702000AD0063,,,,,,,,,,,,,0,,,,,T,terres,,,1633,0.785121,49.583954
2019-1137096,2019-09-12,000001,Vente,22821,,,LE VERBOSC,B034,76190,76702,Touffreville-la-Corbeline,76,,,76702000AD0063,,,,,,,,,,,,,0,,,,,T,terres,,,1634,0.785121,49.583954
2019-1137096,2019-09-12,000001,Vente,22821,,,LE VERBOSC,B034,76190,76702,Touffreville-la-Corbeline,76,,,76702000AD0065,,,,,,,,,,,,,0,,,,,T,terres,,,5727,0.785206,49.584898
2019-1137278,2019-10-11,000001,Vente,190000,272,,IMP DE LA CHIGNERIE,0095,76190,76702,Touffreville-la-Corbeline,76,,,76702000AM0267,,,,,,,,,,,,,0,1,Maison,170,6,J,jardins,,,2451,0.763117,49.586787
2019-1137278,2019-10-11,000001,Vente,190000,272,,IMP DE LA CHIGNERIE,0095,76190,76702,Touffreville-la-Corbeline,76,,,76702000AM0267,,,,,,,,,,,,,0,1,Maison,170,6,S,sols,,,500,0.763117,49.586787
2019-1137551,2019-11-18,000001,Vente,4000,,,LE BOURG,B004,76190,76702,Touffreville-la-Corbeline,76,,,76702000AH0400,,,,,,,,,,,,,0,,,,,AB,terrains a bâtir,,,180,0.765123,49.580156
2019-1137692,2019-11-29,000001,Vente,490000,,,LA COTE DU MONT DU CUL,B012,76190,76702,Touffreville-la-Corbeline,76,,,76702000AI0187,,,,,,,,,,,,,0,,,,,BF,futaies feuillues,,,30000,0.761791,49.567118
2019-1137692,2019-11-29,000001,Vente,490000,,,LA COTE DU MONT DU CUL,B012,76190,76702,Touffreville-la-Corbeline,76,,,76702000AI0187,,,,,,,,,,,,,0,,,,,BT,taillis simples,,,399189,0.761791,49.567118
2019-1137832,2019-12-20,000001,Vente,85000,70,,RTE DU VAL AU CESNE,0240,76190,76702,Touffreville-la-Corbeline,76,,,76702000AH0006,,,,,,,,,,,,,0,1,Maison,100,4,S,sols,,,990,0.762859,49.582828
2019-1137832,2019-12-20,000001,Vente,85000,,,LE BOURG,B004,76190,76702,Touffreville-la-Corbeline,76,,,76702000AH0403,,,,,,,,,,,,,0,,,,,VE,vergers,CIDRE,Cidre,347,0.7626,49.582795
