id_mutation,date_mutation,numero_disposition,nature_mutation,valeur_fonciere,adresse_numero,adresse_suffixe,adresse_nom_voie,adresse_code_voie,code_postal,code_commune,nom_commune,code_departement,ancien_code_commune,ancien_nom_commune,id_parcelle,ancien_id_parcelle,numero_volume,lot1_numero,lot1_surface_carrez,lot2_numero,lot2_surface_carrez,lot3_numero,lot3_surface_carrez,lot4_numero,lot4_surface_carrez,lot5_numero,lot5_surface_carrez,nombre_lots,code_type_local,type_local,surface_reelle_bati,nombre_pieces_principales,code_nature_culture,nature_culture,code_nature_culture_speciale,nature_culture_speciale,surface_terrain,longitude,latitude
2019-1167919,2019-01-15,000001,Vente,145000,6,,RUE DE LA BELLE EPINE,0005,77114,77227,Hermé,77,,,77227000AC0077,,,,,,,,,,,,,0,1,Maison,112,5,S,sols,,,720,3.357587,48.484584
2019-1167919,2019-01-15,000001,Vente,145000,,,LES CHAISES,B014,77114,77227,Hermé,77,,,77227000AC0173,,,,,,,,,,,,,0,,,,,S,sols,,,86,3.357889,48.484575
2019-1167922,2019-01-15,000001,Vente,142000,17,,RUE DES GREVES,0040,77114,77227,Hermé,77,,,772270000D0677,,,,,,,,,,,,,0,1,Maison,120,5,S,sols,,,500,3.343741,48.479847
2019-1167922,2019-01-15,000001,Vente,142000,17,,RUE DES GREVES,0040,77114,77227,Hermé,77,,,772270000D0677,,,,,,,,,,,,,0,1,Maison,120,5,BP,peupleraies,,,413,3.343741,48.479847
2019-1167922,2019-01-15,000001,Vente,142000,17,,RUE DES GREVES,0040,77114,77227,Hermé,77,,,772270000D0677,,,,,,,,,,,,,0,1,Maison,120,5,J,jardins,POTAG,Jardin potager,500,3.343741,48.479847
2019-1168112,2019-03-21,000001,Vente,100000,195,,RUE DE LA GRANCHOTTE,0030,77114,77227,Hermé,77,,,772270000D0702,,,,,,,,,,,,,0,1,Maison,122,5,AG,terrains d'agrément,PARC,Parc,577,3.339852,48.481644
2019-1168112,2019-03-21,000001,Vente,100000,195,,RUE DE LA GRANCHOTTE,0030,77114,77227,Hermé,77,,,772270000D0702,,,,,,,,,,,,,0,1,Maison,122,5,S,sols,,,500,3.339852,48.481644
2019-1168127,2019-03-05,000001,Vente,185000,339,,RUE DE LA GRANCHOTTE,0030,77114,77227,Hermé,77,,,772270000D0639,,,,,,,,,,,,,0,1,Maison,84,3,J,jardins,POTAG,Jardin potager,925,3.337783,48.481546
2019-1168127,2019-03-05,000001,Vente,185000,339,,RUE DE LA GRANCHOTTE,0030,77114,77227,Hermé,77,,,772270000D0639,,,,,,,,,,,,,0,1,Maison,84,3,S,sols,,,500,3.337783,48.481546
2019-1168321,2019-05-22,000001,Vente,38000,,,LES CHAISES,B014,77114,77227,Hermé,77,,,77227000AC0290,,,,,,,,,,,,,0,,,,,S,sols,,,635,3.359195,48.485528
2019-1168321,2019-05-22,000001,Vente,38000,,,LES CHAISES,B014,77114,77227,Hermé,77,,,77227000AC0291,,,,,,,,,,,,,0,,,,,P,prés,,,251,3.359333,48.485264
2019-1168416,2019-06-14,000001,Vente,1000,,,LE MAROIS,B056,77114,77227,Hermé,77,,,772270000C0059,,,,,,,,,,,,,0,,,,,J,jardins,POTAG,Jardin potager,1371,3.358359,48.482679
2019-1168448,2019-06-25,000001,Vente,2764.8,,,LES CHAISES,B014,77114,77227,Hermé,77,,,77227000AC0300,,,,,,,,,,,,,0,,,,,S,sols,,,48,3.35737,48.484252
2019-1168580,2019-07-17,000001,Vente,11423.8,,,BOIS DU TAU,B006,77114,77227,Hermé,77,,,772270000A0078,,,,,,,,,,,,,0,,,,,BT,taillis simples,,,2038,3.351229,48.498486
2019-1168580,2019-07-17,000001,Vente,11423.8,,,LA BACHERE,B001,77114,77227,Hermé,77,,,772270000B0014,,,,,,,,,,,,,0,,,,,BT,taillis simples,,,660,3.367897,48.484548
2019-1168580,2019-07-17,000001,Vente,11423.8,,,LES COMMUNAUTES DE TOURY,B020,77114,77227,Hermé,77,,,772270000B0136,,,,,,,,,,,,,0,,,,,BS,taillis sous futaie,,,2021,3.373489,48.484942
2019-1168580,2019-07-17,000001,Vente,11423.8,,,LES COMMUNAUTES DE TOURY,B020,77114,77227,Hermé,77,,,772270000B0191,,,,,,,,,,,,,0,,,,,BS,taillis sous futaie,,,2225,3.370717,48.48488
2019-1168580,2019-07-17,000001,Vente,11423.8,,,LES COMMUNAUTES DE TOURY,B020,77114,77227,Hermé,77,,,772270000B0192,,,,,,,,,,,,,0,,,,,BS,taillis sous futaie,,,1013,3.371504,48.48421
2019-1168580,2019-07-17,000001,Vente,11423.8,,,LA GRANDE PATURE,B034,77114,77227,Hermé,77,,,772270000B0324,,,,,,,,,,,,,0,,,,,BS,taillis sous futaie,,,636,3.370716,48.48266
2019-1168580,2019-07-17,000001,Vente,11423.8,,,LA GRANDE PATURE,B034,77114,77227,Hermé,77,,,772270000B0325,,,,,,,,,,,,,0,,,,,BS,taillis sous futaie,,,90,3.371102,48.482366
2019-1168580,2019-07-17,000001,Vente,11423.8,,,LA GRANDE PATURE,B034,77114,77227,Hermé,77,,,772270000B0340,,,,,,,,,,,,,0,,,,,BS,taillis sous futaie,,,647,3.371544,48.483169
2019-1168580,2019-07-17,000001,Vente,11423.8,,,LA GRANDE PATURE,B034,77114,77227,Hermé,77,,,772270000B0404,,,,,,,,,,,,,0,,,,,BS,taillis sous futaie,,,700,3.375573,48.484808
2019-1168580,2019-07-17,000001,Vente,11423.8,,,LA GRANDE PATURE,B034,77114,77227,Hermé,77,,,772270000B0429,,,,,,,,,,,,,0,,,,,BS,taillis sous futaie,,,3950,3.378728,48.482825
2019-1168580,2019-07-17,000001,Vente,11423.8,,,LA GRANDE PATURE,B034,77114,77227,Hermé,77,,,772270000B0492,,,,,,,,,,,,,0,,,,,BS,taillis sous futaie,,,1810,3.371522,48.482118
2019-1168580,2019-07-17,000001,Vente,11423.8,,,BOUCHON BOUDIER,B008,77114,77227,Hermé,77,,,772270000B0513,,,,,,,,,,,,,0,,,,,BS,taillis sous futaie,,,180,3.370253,48.481034
2019-1168580,2019-07-17,000001,Vente,11423.8,,,BOUCHON BOUDIER,B008,77114,77227,Hermé,77,,,772270000B0514,,,,,,,,,,,,,0,,,,,BS,taillis sous futaie,,,1010,3.370444,48.480575
2019-1168580,2019-07-17,000001,Vente,11423.8,,,HUBERME,B047,77114,77227,Hermé,77,,,772270000B0585,,,,,,,,,,,,,0,,,,,BS,taillis sous futaie,,,2125,3.37927,48.483809
2019-1168580,2019-07-17,000001,Vente,11423.8,,,VENISE,B098,77114,77227,Hermé,77,,,772270000B0615,,,,,,,,,,,,,0,,,,,BS,taillis sous futaie,,,1505,3.37992,48.480505
2019-1168580,2019-07-17,000001,Vente,11423.8,,,VENISE,B098,77114,77227,Hermé,77,,,772270000B0616,,,,,,,,,,,,,0,,,,,BS,taillis sous futaie,,,1440,3.380993,48.480817
2019-1168580,2019-07-17,000001,Vente,11423.8,,,VENISE,B098,77114,77227,Hermé,77,,,772270000B0619,,,,,,,,,,,,,0,,,,,BT,taillis simples,,,240,3.379605,48.480736
2019-1168580,2019-07-17,000001,Vente,11423.8,,,VENISE,B098,77114,77227,Hermé,77,,,772270000B0620,,,,,,,,,,,,,0,,,,,BT,taillis simples,,,715,3.380724,48.481034
2019-1168580,2019-07-17,000001,Vente,11423.8,,,VENISE,B098,77114,77227,Hermé,77,,,772270000B0625,,,,,,,,,,,,,0,,,,,BS,taillis sous futaie,,,1075,3.379889,48.481157
2019-1168580,2019-07-17,000001,Vente,11423.8,,,VENISE,B098,77114,77227,Hermé,77,,,772270000B0640,,,,,,,,,,,,,0,,,,,BS,taillis sous futaie,,,850,3.381345,48.480251
2019-1168580,2019-07-17,000001,Vente,11423.8,,,LE FRENE,B030,77114,77227,Hermé,77,,,772270000B0682,,,,,,,,,,,,,0,,,,,BS,taillis sous futaie,,,965,3.378022,48.480375
2019-1168580,2019-07-17,000001,Vente,11423.8,,,LES FOUX,B029,77114,77227,Hermé,77,,,772270000B0740,,,,,,,,,,,,,0,,,,,BS,taillis sous futaie,,,503,3.369906,48.476887
2019-1168580,2019-07-17,000001,Vente,11423.8,,,LES FOUX,B029,77114,77227,Hermé,77,,,772270000B0744,,,,,,,,,,,,,0,,,,,BT,taillis simples,,,393,3.369511,48.476765
2019-1168580,2019-07-17,000001,Vente,11423.8,,,LE MOUTOIS,B063,77114,77227,Hermé,77,,,772270000C0008,,,,,,,,,,,,,0,,,,,BS,taillis sous futaie,,,1173,3.353189,48.482745
2019-1168580,2019-07-17,000001,Vente,11423.8,,,LE MOUTOIS,B063,77114,77227,Hermé,77,,,772270000C0031,,,,,,,,,,,,,0,,,,,BT,taillis simples,,,946,3.355178,48.481362
2019-1168580,2019-07-17,000001,Vente,11423.8,,,LE MOUTOIS,B063,77114,77227,Hermé,77,,,772270000C0039,,,,,,,,,,,,,0,,,,,BS,taillis sous futaie,,,1335,3.355555,48.482337
2019-1168580,2019-07-17,000001,Vente,11423.8,,,LE MAROIS,B056,77114,77227,Hermé,77,,,772270000C0122,,,,,,,,,,,,,0,,,,,BS,taillis sous futaie,,,704,3.362738,48.480338
2019-1168580,2019-07-17,000001,Vente,11423.8,,,LE MAROIS,B056,77114,77227,Hermé,77,,,772270000C0123,,,,,,,,,,,,,0,,,,,BS,taillis sous futaie,,,966,3.36358,48.480409
2019-1168580,2019-07-17,000001,Vente,11423.8,,,LE MAROIS,B056,77114,77227,Hermé,77,,,772270000C0146,,,,,,,,,,,,,0,,,,,BS,taillis sous futaie,,,1390,3.362766,48.481716
2019-1168580,2019-07-17,000001,Vente,11423.8,,,LE MAROIS,B056,77114,77227,Hermé,77,,,772270000C0167,,,,,,,,,,,,,0,,,,,BT,taillis simples,,,90,3.36134,48.482135
2019-1168580,2019-07-17,000001,Vente,11423.8,,,LE MAROIS,B056,77114,77227,Hermé,77,,,772270000C0168,,,,,,,,,,,,,0,,,,,BT,taillis simples,,,510,3.361707,48.481389
2019-1168580,2019-07-17,000001,Vente,11423.8,,,LE COMPORTE,B021,77114,77227,Hermé,77,,,772270000C0254,,,,,,,,,,,,,0,,,,,BS,taillis sous futaie,,,415,3.364034,48.479916
2019-1168580,2019-07-17,000001,Vente,11423.8,,,LE COMPORTE,B021,77114,77227,Hermé,77,,,772270000C0286,,,,,,,,,,,,,0,,,,,BS,taillis sous futaie,,,699,3.36176,48.478405
2019-1168580,2019-07-17,000001,Vente,11423.8,,,LES INGLES,B049,77114,77227,Hermé,77,,,772270000C0365,,,,,,,,,,,,,0,,,,,P,prés,,,800,3.367593,48.476824
2019-1168580,2019-07-17,000001,Vente,11423.8,,,LA PETITE GARENNE,B071,77114,77227,Hermé,77,,,772270000C0497,,,,,,,,,,,,,0,,,,,BT,taillis simples,,,315,3.354096,48.476477
2019-1168580,2019-07-17,000001,Vente,11423.8,,,PRES DESMALLETONS,B082,77114,77227,Hermé,77,,,772270000E0192,,,,,,,,,,,,,0,,,,,L,landes,FRICH,Friche,910,3.323258,48.473124
2019-1168580,2019-07-17,000001,Vente,11423.8,,,LA QUEUE GUERIN,B084,77114,77227,Hermé,77,,,772270000G0006,,,,,,,,,,,,,0,,,,,L,landes,FRICH,Friche,353,3.336995,48.495199
2019-1168580,2019-07-17,000001,Vente,11423.8,,,LE TROU ROUGE,B092,77114,77227,Hermé,77,,,77227000ZM0028,,,,,,,,,,,,,0,,,,,BT,taillis simples,,,1440,3.373622,48.48735
2019-1168730,2019-09-02,000001,Vente,904.8,,,LES CHAISES,B014,77114,77227,Hermé,77,,,77227000AC0303,,,,,,,,,,,,,0,,,,,S,sols,,,58,3.35704,48.483945
2019-1168738,2019-09-06,000001,Vente,12000,12,T,RUE DE SERVOLLES,0174,77114,77227,Hermé,77,,,77227000ZH0021,,,,,,,,,,,,,0,3,Dépendance,,0,T,terres,,,500,3.327669,48.48829
2019-1168738,2019-09-06,000001,Vente,12000,12,T,RUE DE SERVOLLES,0174,77114,77227,Hermé,77,,,77227000ZH0021,,,,,,,,,,,,,0,3,Dépendance,,0,S,sols,,,290,3.327669,48.48829
2019-1168738,2019-09-06,000001,Vente,12000,,,SERVOLLES,B088,77114,77227,Hermé,77,,,77227000ZI0044,,,,,,,,,,,,,0,,,,,T,terres,,,1870,3.327274,48.488388
2019-1169125,2019-12-04,000001,Vente,982.8,,,LES CHAISES,B014,77114,77227,Hermé,77,,,77227000AC0305,,,,,,,,,,,,,0,,,,,S,sols,,,56,3.357336,48.483977
2019-1169125,2019-12-04,000001,Vente,982.8,,,LES CHAISES,B014,77114,77227,Hermé,77,,,77227000AC0307,,,,,,,,,,,,,0,,,,,AG,terrains d'agrément,PARC,Parc,6,3.357318,48.483848
2019-1169127,2019-12-04,000001,Vente,9456,,,LES CHAISES,B014,77114,77227,Hermé,77,,,77227000AC0298,,,,,,,,,,,,,0,,,,,S,sols,,,10,3.357058,48.484242
2019-1169162,2019-12-11,000001,Vente,147660,11,,RUE DES GREVES,0040,77114,77227,Hermé,77,,,77227000AB0092,,,,,,,,,,,,,0,1,Maison,119,5,S,sols,,,296,3.342796,48.480672
2019-1169162,2019-12-11,000001,Vente,147660,,,HERME,B045,77114,77227,Hermé,77,,,77227000AB0247,,,,,,,,,,,,,0,,,,,AB,terrains a bâtir,,,704,3.342855,48.4807
2019-1169169,2019-12-12,000001,Vente,185000,8,,RUE EMILE TRIPE,0013,77114,77227,Hermé,77,,,77227000AB0020,,,,,,,,,,,,,0,1,Maison,102,3,S,sols,,,1447,3.344475,48.482714
2019-1169234,2019-12-20,000001,Vente,139000,1,,RTE DE BELLEVUE,0007,77114,77227,Hermé,77,,,77227000ZC0075,,,,,,,,,,,,,0,1,Maison,98,5,S,sols,,,1001,3.346819,48.484909
2019-1169234,2019-12-20,000001,Vente,139000,1,,RTE DE BELLEVUE,0007,77114,77227,Hermé,77,,,77227000ZC0075,,,,,,,,,,,,,0,1,Maison,98,5,AG,terrains d'agrément,PARC,Parc,319,3.346819,48.484909
