id_mutation,date_mutation,numero_disposition,nature_mutation,valeur_fonciere,adresse_numero,adresse_suffixe,adresse_nom_voie,adresse_code_voie,code_postal,code_commune,nom_commune,code_departement,ancien_code_commune,ancien_nom_commune,id_parcelle,ancien_id_parcelle,numero_volume,lot1_numero,lot1_surface_carrez,lot2_numero,lot2_surface_carrez,lot3_numero,lot3_surface_carrez,lot4_numero,lot4_surface_carrez,lot5_numero,lot5_surface_carrez,nombre_lots,code_type_local,type_local,surface_reelle_bati,nombre_pieces_principales,code_nature_culture,nature_culture,code_nature_culture_speciale,nature_culture_speciale,surface_terrain,longitude,latitude
2019-1189992,2019-01-04,000003,Vente,113000,,,LE TROU BOURDON,B079,78840,78255,Freneuse,78,,,782550000C3816,,,,,,,,,,,,,0,,,,,S,sols,,,259,1.599246,49.051015
2019-1189992,2019-01-04,000003,Vente,113000,26,,RUE DE L EAU,0020,78840,78255,Freneuse,78,,,782550000C3817,,,,,,,,,,,,,0,1,Maison,36,1,,,,,,1.599432,49.05094
2019-1189998,2019-01-14,000001,Vente en l'état futur d'achèvement,180000,,,LA RAVINE,B068,78840,78255,Freneuse,78,,,782550000C3740,,,86,,,,,,,,,,1,3,Dépendance,,0,,,,,,1.590963,49.040004
2019-1189998,2019-01-14,000001,Vente en l'état futur d'achèvement,180000,,,LA RAVINE,B068,78840,78255,Freneuse,78,,,782550000C3740,,,45,,,,,,,,,,1,3,Dépendance,,0,,,,,,1.590963,49.040004
2019-1189998,2019-01-14,000001,Vente en l'état futur d'achèvement,180000,,,LA RAVINE,B068,78840,78255,Freneuse,78,,,782550000C3740,,,4,,,,,,,,,,1,2,Appartement,64,3,,,,,,1.590963,49.040004
2019-1190021,2019-01-11,000001,Vente,500,,,RUE DE L EAU,0020,78840,78255,Freneuse,78,,,782550000C0066,,,,,,,,,,,,,0,,,,,J,jardins,POTAG,Jardin potager,274,1.598208,49.050194
2019-1190026,2019-01-14,000001,Vente en l'état futur d'achèvement,180000,,,LA RAVINE,B068,78840,78255,Freneuse,78,,,782550000C3740,,,46,,,,,,,,,,1,3,Dépendance,,0,,,,,,1.590963,49.040004
2019-1190026,2019-01-14,000001,Vente en l'état futur d'achèvement,180000,,,LA RAVINE,B068,78840,78255,Freneuse,78,,,782550000C3740,,,87,,,,,,,,,,1,3,Dépendance,,0,,,,,,1.590963,49.040004
2019-1190026,2019-01-14,000001,Vente en l'état futur d'achèvement,180000,,,LA RAVINE,B068,78840,78255,Freneuse,78,,,782550000C3740,,,2,,,,,,,,,,1,2,Appartement,65,3,,,,,,1.590963,49.040004
2019-1190065,2019-01-16,000001,Vente,95000,,,LES COCHONNETTES,B030,78840,78255,Freneuse,78,,,782550000C3463,,,,,,,,,,,,,0,,,,,S,sols,,,283,1.600876,49.043216
2019-1190065,2019-01-16,000001,Vente,95000,,,LES COCHONNETTES,B030,78840,78255,Freneuse,78,,,782550000C3679,,,,,,,,,,,,,0,,,,,AB,terrains a bâtir,,,698,1.600923,49.043103
2019-1190106,2019-01-18,000001,Vente,335000,7,,CHE DE LA VALLEE,1025,78840,78255,Freneuse,78,,,782550000B2389,,,,,,,,,,,,,0,1,Maison,180,5,S,sols,,,500,1.609134,49.051049
2019-1190106,2019-01-18,000001,Vente,335000,7,,CHE DE LA VALLEE,1025,78840,78255,Freneuse,78,,,782550000B2389,,,,,,,,,,,,,0,1,Maison,180,5,J,jardins,POTAG,Jardin potager,2330,1.609134,49.051049
2019-1190132,2019-01-28,000001,Vente en l'état futur d'achèvement,119000,,,LA RAVINE,B068,78840,78255,Freneuse,78,,,782550000C3740,,,90,,,,,,,,,,1,3,Dépendance,,0,,,,,,1.590963,49.040004
2019-1190132,2019-01-28,000001,Vente en l'état futur d'achèvement,119000,,,LA RAVINE,B068,78840,78255,Freneuse,78,,,782550000C3740,,,6,,,,,,,,,,1,2,Appartement,37,2,,,,,,1.590963,49.040004
2019-1190132,2019-01-28,000001,Vente en l'état futur d'achèvement,119000,,,LA RAVINE,B068,78840,78255,Freneuse,78,,,782550000C3740,,,37,,,,,,,,,,1,3,Dépendance,,0,,,,,,1.590963,49.040004
2019-1190149,2019-01-25,000001,Vente,530000,9,,CHE DE LA REPUBLIQUE,0895,78840,78255,Freneuse,78,,,782550000D0689,,,,,,,,,,,,,0,4,Local industriel. commercial ou assimilé,330,0,S,sols,,,1700,1.604556,49.036759
2019-1190172,2019-02-09,000001,Vente,193720,5,,RUE DES CLEDEVILLES,0230,78840,78255,Freneuse,78,,,782550000C3575,,,,,,,,,,,,,0,1,Maison,83,5,S,sols,,,155,1.600063,49.041426
2019-1190206,2019-02-02,000001,Vente,210000,44,,RUE CHARLES DE GAULLE,0180,78840,78255,Freneuse,78,,,782550000C3603,,,,,,,,,,,,,0,4,Local industriel. commercial ou assimilé,32,0,S,sols,,,315,1.59786,49.04537
2019-1190206,2019-02-02,000001,Vente,210000,44,,RUE CHARLES DE GAULLE,0180,78840,78255,Freneuse,78,,,782550000C3603,,,,,,,,,,,,,0,1,Maison,82,4,S,sols,,,315,1.59786,49.04537
2019-1190218,2019-02-01,000001,Vente,114996.84,,,LES VENTINES,B084,78840,78255,Freneuse,78,,,782550000D0707,,,,,,,,,,,,,0,,,,,AB,terrains a bâtir,,,3977,,
2019-1190218,2019-02-01,000001,Vente,114996.84,,,LES VENTINES,B084,78840,78255,Freneuse,78,,,782550000D0708,,,,,,,,,,,,,0,,,,,T,terres,,,175,1.600147,49.03732
2019-1190219,2019-02-01,000002,Vente,5003.16,,,LES VENTINES,B084,78840,78255,Freneuse,78,,,782550000D0704,,,,,,,,,,,,,0,,,,,AB,terrains a bâtir,,,173,1.60121,49.03746
2019-1190303,2019-02-15,000001,Vente,260000,1,D,IMP DES BOUDERIES,0109,78840,78255,Freneuse,78,,,782550000D0686,,,,,,,,,,,,,0,4,Local industriel. commercial ou assimilé,704,0,S,sols,,,4136,1.605773,49.037807
2019-1190304,2019-02-14,000001,Vente en l'état futur d'achèvement,169000,,,LA RAVINE,B068,78840,78255,Freneuse,78,,,782550000C3740,,,82,,,,,,,,,,1,3,Dépendance,,0,,,,,,1.590963,49.040004
2019-1190304,2019-02-14,000001,Vente en l'état futur d'achèvement,169000,,,LA RAVINE,B068,78840,78255,Freneuse,78,,,782550000C3740,,,43,,,,,,,,,,1,3,Dépendance,,0,,,,,,1.590963,49.040004
2019-1190304,2019-02-14,000001,Vente en l'état futur d'achèvement,169000,,,LA RAVINE,B068,78840,78255,Freneuse,78,,,782550000C3740,,,9,,,,,,,,,,1,2,Appartement,53,3,,,,,,1.590963,49.040004
2019-1190310,2019-02-19,000001,Vente en l'état futur d'achèvement,133000,,,LA RAVINE,B068,78840,78255,Freneuse,78,,,782550000C3740,,,75,,,,,,,,,,1,3,Dépendance,,0,,,,,,1.590963,49.040004
2019-1190310,2019-02-19,000001,Vente en l'état futur d'achèvement,133000,,,LA RAVINE,B068,78840,78255,Freneuse,78,,,782550000C3740,,,48,,,,,,,,,,1,3,Dépendance,,0,,,,,,1.590963,49.040004
2019-1190310,2019-02-19,000001,Vente en l'état futur d'achèvement,133000,,,LA RAVINE,B068,78840,78255,Freneuse,78,,,782550000C3740,,,31,,,,,,,,,,1,2,Appartement,43,2,,,,,,1.590963,49.040004
2019-1190325,2019-02-26,000001,Vente en l'état futur d'achèvement,131000,,,LA RAVINE,B068,78840,78255,Freneuse,78,,,782550000C3740,,,74,,,,,,,,,,1,3,Dépendance,,0,,,,,,1.590963,49.040004
2019-1190325,2019-02-26,000001,Vente en l'état futur d'achèvement,131000,,,LA RAVINE,B068,78840,78255,Freneuse,78,,,782550000C3740,,,54,,,,,,,,,,1,3,Dépendance,,0,,,,,,1.590963,49.040004
2019-1190325,2019-02-26,000001,Vente en l'état futur d'achèvement,131000,,,LA RAVINE,B068,78840,78255,Freneuse,78,,,782550000C3740,,,26,,,,,,,,,,1,2,Appartement,43,2,,,,,,1.590963,49.040004
2019-1190326,2019-02-20,000001,Vente en l'état futur d'achèvement,203000,,,LES BALOCHES,B001,78840,78255,Freneuse,78,,,782550000C3812,,,,,,,,,,,,,0,,,,,AB,terrains a bâtir,,,95,1.591294,49.039954
2019-1190406,2019-02-26,000001,Vente,178000,9,,RUE DE L ILE DE FRANCE,0570,78840,78255,Freneuse,78,,,782550000E0492,,,,,,,,,,,,,0,1,Maison,68,4,S,sols,,,496,1.599616,49.033381
2019-1190475,2019-03-14,000001,Vente en l'état futur d'achèvement,156800,,,LA RAVINE,B068,78840,78255,Freneuse,78,,,782550000C3740,,,42,,,,,,,,,,1,3,Dépendance,,0,,,,,,1.590963,49.040004
2019-1190475,2019-03-14,000001,Vente en l'état futur d'achèvement,156800,,,LA RAVINE,B068,78840,78255,Freneuse,78,,,782550000C3740,,,1,,,,,,,,,,1,2,Appartement,64,3,,,,,,1.590963,49.040004
2019-1190475,2019-03-14,000001,Vente en l'état futur d'achèvement,156800,,,LA RAVINE,B068,78840,78255,Freneuse,78,,,782550000C3740,,,81,,,,,,,,,,1,3,Dépendance,,0,,,,,,1.590963,49.040004
2019-1190651,2019-03-29,000001,Vente,68000,16,,RUE DES VENTINES,1028,78840,78255,Freneuse,78,,,782550000C2118,,,,,,,,,,,,,0,1,Maison,83,6,S,sols,,,503,1.597768,49.038758
2019-1190701,2019-03-28,000001,Vente,105000,3,,CHE DES GAILLARDS,0365,78840,78255,Freneuse,78,,,782550000C0660,,,,,,,,,,,,,0,3,Dépendance,,0,S,sols,,,86,1.603339,49.04707
2019-1190701,2019-03-28,000001,Vente,105000,3,,CHE DES GAILLARDS,0365,78840,78255,Freneuse,78,,,782550000C2611,,,,,,,,,,,,,0,1,Maison,80,4,S,sols,,,90,1.60326,49.047196
2019-1190797,2019-04-05,000001,Vente,221000,33,,RUE DES VENTINES,1028,78840,78255,Freneuse,78,,,782550000C2137,,,,,,,,,,,,,0,1,Maison,117,5,S,sols,,,484,1.598183,49.039654
2019-1190806,2019-04-11,000001,Vente,240000,15,,RUE DES VERGERS,1029,78840,78255,Freneuse,78,,,782550000C3132,,,,,,,,,,,,,0,1,Maison,118,6,S,sols,,,414,1.602286,49.042561
2019-1190810,2019-04-10,000001,Vente,250000,9,,RUE CURIE,0281,78840,78255,Freneuse,78,,,782550000C2290,,,,,,,,,,,,,0,4,Local industriel. commercial ou assimilé,2000,0,S,sols,,,1375,1.602851,49.04566
2019-1190810,2019-04-10,000001,Vente,250000,9,,RUE CURIE,0281,78840,78255,Freneuse,78,,,782550000C2291,,,,,,,,,,,,,0,,,,,S,sols,,,142,1.602516,49.045985
2019-1191016,2019-05-16,000001,Vente,75000,,,LES SENTIERS,B071,78840,78255,Freneuse,78,,,782550000C2729,,,,,,,,,,,,,0,,,,,T,terres,,,764,1.59935,49.043375
2019-1191016,2019-05-16,000001,Vente,75000,,,LES SENTIERS,B071,78840,78255,Freneuse,78,,,782550000C2730,,,,,,,,,,,,,0,,,,,S,sols,,,46,1.599844,49.043093
2019-1191093,2019-05-24,000001,Vente,24364,,,LE BATEAU DE L ILE,B006,78840,78255,Freneuse,78,,,782550000C0043,,,,,,,,,,,,,0,,,,,T,terres,,,2291,1.596663,49.048202
2019-1191093,2019-05-24,000001,Vente,24364,,,SOUS LA RUELLE GAUTIERE,B073,78840,78255,Freneuse,78,,,782550000C0138,,,,,,,,,,,,,0,,,,,P,prés,,,1084,1.597097,49.047856
2019-1191093,2019-05-24,000001,Vente,24364,,,LES NOUREAUX,B059,78840,78255,Freneuse,78,,,782550000C0171,,,,,,,,,,,,,0,,,,,T,terres,,,1508,1.595401,49.045376
2019-1191093,2019-05-24,000001,Vente,24364,,,LE FOND DU MOULIN,B042,78840,78255,Freneuse,78,,,782550000D0428,,,,,,,,,,,,,0,,,,,T,terres,,,8256,1.610395,49.039877
2019-1191093,2019-05-24,000001,Vente,24364,,,LES BELLES VUES,B009,78840,78255,Freneuse,78,,,782550000D0480,,,,,,,,,,,,,0,,,,,T,terres,,,9790,1.614736,49.043755
2019-1191093,2019-05-24,000001,Vente,24364,,,LA CROIX DU MOULIN,B036,78840,78255,Freneuse,78,,,782550000D0525,,,,,,,,,,,,,0,,,,,T,terres,,,4057,1.607699,49.038697
2019-1191111,2019-05-17,000001,Vente,180000,7,,CHE DES GAILLARDS,0365,78840,78255,Freneuse,78,,,782550000C2266,,,,,,,,,,,,,0,2,Appartement,36,1,S,sols,,,248,1.603428,49.047085
2019-1191111,2019-05-17,000001,Vente,180000,7,,CHE DES GAILLARDS,0365,78840,78255,Freneuse,78,,,782550000C2266,,,,,,,,,,,,,0,2,Appartement,45,2,S,sols,,,248,1.603428,49.047085
2019-1191111,2019-05-17,000001,Vente,180000,7,,CHE DES GAILLARDS,0365,78840,78255,Freneuse,78,,,782550000C2266,,,,,,,,,,,,,0,2,Appartement,62,3,S,sols,,,248,1.603428,49.047085
2019-1191114,2019-05-17,000001,Vente,290000,13,,RUE HENRI BOUCAUT,0510,78840,78255,Freneuse,78,,,782550000C0487,,,,,,,,,,,,,0,1,Maison,134,6,S,sols,,,456,1.601367,49.049267
2019-1191114,2019-05-17,000001,Vente,290000,,,LE VILLAGE,B086,78840,78255,Freneuse,78,,,782550000C0488,,,,,,,,,,,,,0,,,,,J,jardins,POTAG,Jardin potager,912,1.600971,49.049401
2019-1191164,2019-05-28,000001,Vente,350000,12,A,RUE DU GEN LECLERC,0420,78840,78255,Freneuse,78,,,782550000C0327,,,,,,,,,,,,,0,2,Appartement,80,2,S,sols,,,455,1.602023,49.047791
2019-1191164,2019-05-28,000001,Vente,350000,12,A,RUE DU GEN LECLERC,0420,78840,78255,Freneuse,78,,,782550000C0327,,,,,,,,,,,,,0,2,Appartement,72,2,S,sols,,,455,1.602023,49.047791
2019-1191164,2019-05-28,000001,Vente,350000,12,A,RUE DU GEN LECLERC,0420,78840,78255,Freneuse,78,,,782550000C0327,,,,,,,,,,,,,0,2,Appartement,104,3,S,sols,,,455,1.602023,49.047791
2019-1191164,2019-05-28,000001,Vente,350000,12,A,RUE DU GEN LECLERC,0420,78840,78255,Freneuse,78,,,782550000C0327,,,,,,,,,,,,,0,2,Appartement,94,3,S,sols,,,455,1.602023,49.047791
2019-1191281,2019-06-05,000001,Vente,235000,51,,RUE CURIE,0281,78840,78255,Freneuse,78,,,782550000C2739,,,,,,,,,,,,,0,1,Maison,105,4,S,sols,,,500,1.600425,49.044375
2019-1191281,2019-06-05,000001,Vente,235000,51,,RUE CURIE,0281,78840,78255,Freneuse,78,,,782550000C2739,,,,,,,,,,,,,0,1,Maison,105,4,AG,terrains d'agrément,JARD,Jardin d'agrément,411,1.600425,49.044375
2019-1191281,2019-06-05,000001,Vente,235000,,,LES SENTIERS,B071,78840,78255,Freneuse,78,,,782550000C2740,,,,,,,,,,,,,0,,,,,S,sols,,,34,1.600942,49.044057
2019-1191304,2019-06-13,000001,Vente,220000,21,,RUE DES VENTINES,1028,78840,78255,Freneuse,78,,,782550000C2110,,,,,,,,,,,,,0,1,Maison,104,5,S,sols,,,474,1.597072,49.039158
2019-1191388,2019-06-27,000002,Vente,7000,,,LES CLEDEVILLES,B027,78840,78255,Freneuse,78,,,782550000C3737,,,,,,,,,,,,,0,,,,,T,terres,,,88,1.59448,49.04144
2019-1191454,2019-06-28,000001,Vente,170000,4,,RUE DU LANGUEDOC,0550,78840,78255,Freneuse,78,,,782550000E0363,,,,,,,,,,,,,0,1,Maison,66,4,S,sols,,,612,1.598624,49.034858
2019-1191661,2019-07-16,000001,Vente,206000,,,LA RAVINE,B068,78840,78255,Freneuse,78,,,782550000C3740,,,69,,,,,,,,,,1,3,Dépendance,,0,,,,,,1.590963,49.040004
2019-1191661,2019-07-16,000001,Vente,206000,,,LA RAVINE,B068,78840,78255,Freneuse,78,,,782550000C3740,,,68,,,,,,,,,,1,3,Dépendance,,0,,,,,,1.590963,49.040004
2019-1191661,2019-07-16,000001,Vente,206000,,,LES BALOCHES,B001,78840,78255,Freneuse,78,,,782550000C3811,,,,,,,,,,,,,0,,,,,AB,terrains a bâtir,,,97,1.591272,49.040014
2019-1191726,2019-07-03,000001,Vente,210000,2,,RUE DES VIGNES A MONSIEUR,1030,78840,78255,Freneuse,78,,,782550000B0172,,,,,,,,,,,,,0,1,Maison,110,4,S,sols,,,500,1.607859,49.050517
2019-1191726,2019-07-03,000001,Vente,210000,2,,RUE DES VIGNES A MONSIEUR,1030,78840,78255,Freneuse,78,,,782550000B0172,,,,,,,,,,,,,0,1,Maison,110,4,J,jardins,POTAG,Jardin potager,383,1.607859,49.050517
2019-1191738,2019-07-16,000001,Vente,170000,7,,RUE DU GEN LECLERC,0420,78840,78255,Freneuse,78,,,782550000C2839,,,,,,,,,,,,,0,1,Maison,152,7,S,sols,,,324,1.602541,49.047843
2019-1191783,2019-07-17,000001,Vente,195000,3,,RUE DU  SENTIER,0890,78840,78255,Freneuse,78,,,782550000C1990,,,,,,,,,,,,,0,,,,,S,sols,,,78,1.599772,49.046213
2019-1191783,2019-07-17,000001,Vente,195000,,,RUE DU  SENTIER,0890,78840,78255,Freneuse,78,,,782550000C1994,,,,,,,,,,,,,0,,,,,S,sols,,,1,1.599927,49.04608
2019-1191783,2019-07-17,000001,Vente,195000,3,,RUE DU  SENTIER,0890,78840,78255,Freneuse,78,,,782550000C2578,,,,,,,,,,,,,0,1,Maison,110,5,S,sols,,,274,1.599833,49.04621
2019-1191868,2019-07-27,000002,Vente,135000,58,,RUE CURIE,0281,78840,78255,Freneuse,78,,,782550000C3604,,,,,,,,,,,,,0,1,Maison,58,2,AG,terrains d'agrément,PARC,Parc,116,1.598,49.045333
2019-1191982,2019-07-31,000001,Vente,310000,24,,RUE DU CRIQUET,0280,78840,78255,Freneuse,78,,,782550000B2613,,,,,,,,,,,,,0,1,Maison,120,4,S,sols,,,1038,1.606742,49.052647
2019-1191988,2019-08-22,000001,Vente,167000,10,,RES LES SENTIERS,A030,78840,78255,Freneuse,78,,,782550000C1926,,,,,,,,,,,,,0,1,Maison,75,3,S,sols,,,640,1.603652,49.044244
2019-1192069,2019-08-08,000001,Vente,185000,15,,RUE DE BRETAGNE,0160,78840,78255,Freneuse,78,,,782550000E0636,,,,,,,,,,,,,0,1,Maison,68,4,AG,terrains d'agrément,JARD,Jardin d'agrément,1238,1.599139,49.032229
2019-1192069,2019-08-08,000001,Vente,185000,15,,RUE DE BRETAGNE,0160,78840,78255,Freneuse,78,,,782550000E0636,,,,,,,,,,,,,0,1,Maison,68,4,S,sols,,,500,1.599139,49.032229
2019-1192086,2019-08-30,000001,Vente,215000,26,,RUE DU CRIQUET,0280,78840,78255,Freneuse,78,,,782550000B2612,,,,,,,,,,,,,0,1,Maison,83,4,AG,terrains d'agrément,JARD,Jardin d'agrément,815,1.606987,49.052447
2019-1192086,2019-08-30,000001,Vente,215000,26,,RUE DU CRIQUET,0280,78840,78255,Freneuse,78,,,782550000B2612,,,,,,,,,,,,,0,1,Maison,83,4,S,sols,,,500,1.606987,49.052447
2019-1192087,2019-08-30,000001,Vente,233000,39,,RUE DE MERICOURT,0696,78840,78255,Freneuse,78,,,782550000C2653,,,,,,,,,,,,,0,1,Maison,125,4,AG,terrains d'agrément,JARD,Jardin d'agrément,430,1.606155,49.046263
2019-1192087,2019-08-30,000001,Vente,233000,39,,RUE DE MERICOURT,0696,78840,78255,Freneuse,78,,,782550000C2653,,,,,,,,,,,,,0,1,Maison,125,4,S,sols,,,500,1.606155,49.046263
2019-1192113,2019-08-23,000001,Vente,371000,10,,RUE DE MOUSSEAUX,0700,78840,78255,Freneuse,78,,,782550000B2533,,,,,,,,,,,,,0,1,Maison,250,7,S,sols,,,500,1.606442,49.051007
2019-1192113,2019-08-23,000001,Vente,371000,10,,RUE DE MOUSSEAUX,0700,78840,78255,Freneuse,78,,,782550000B2533,,,,,,,,,,,,,0,1,Maison,250,7,J,jardins,POTAG,Jardin potager,820,1.606442,49.051007
2019-1192138,2019-09-06,000001,Vente,120000,28,,RUE DU GEN LECLERC,0420,78840,78255,Freneuse,78,,,782550000C3410,,,,,,,,,,,,,0,1,Maison,44,2,S,sols,,,342,1.603612,49.045894
2019-1192154,2019-08-28,000001,Vente en l'état futur d'achèvement,120000,,,LA RAVINE,B068,78840,78255,Freneuse,78,,,782550000C3740,,,12,,,,,,,,,,1,2,Appartement,36,2,,,,,,1.590963,49.040004
2019-1192154,2019-08-28,000001,Vente en l'état futur d'achèvement,120000,,,LA RAVINE,B068,78840,78255,Freneuse,78,,,782550000C3740,,,39,,,,,,,,,,1,3,Dépendance,,0,,,,,,1.590963,49.040004
2019-1192154,2019-08-28,000001,Vente en l'état futur d'achèvement,120000,,,LA RAVINE,B068,78840,78255,Freneuse,78,,,782550000C3740,,,69,,,,,,,,,,1,3,Dépendance,,0,,,,,,1.590963,49.040004
2019-1192297,2019-09-20,000001,Vente,178000,68,,RUE CHARLES DE GAULLE,0180,78840,78255,Freneuse,78,,,782550000C0374,,,,,,,,,,,,,0,1,Maison,95,5,S,sols,,,172,1.59956,49.046878
2019-1192366,2019-09-26,000001,Vente,900789.75,6,,RUE DE LA REPUBLIQUE,0896,78840,78255,Freneuse,78,,,782550000D0723,,,,,,,,,,,,,0,4,Local industriel. commercial ou assimilé,983,0,S,sols,,,3251,1.606139,49.035339
2019-1192375,2019-09-26,000001,Vente,196000,14,,RUE SAINT MARTIN,0695,78840,78255,Freneuse,78,,,782550000C3563,,,,,,,,,,,,,0,1,Maison,75,5,S,sols,,,169,1.599742,49.0406
2019-1192457,2019-09-26,000003,Vente,37440,,,LES BOUDERIES,B015,78840,78255,Freneuse,78,,,782550000D0774,,,,,,,,,,,,,0,,,,,T,terres,,,1200,1.606704,49.035935
2019-1192458,2019-09-26,000004,Vente,,,,LES BOUDERIES,B015,78840,78255,Freneuse,78,,,782550000D0774,,,,,,,,,,,,,0,,,,,T,terres,,,1200,1.606704,49.035935
2019-1192561,2019-10-08,000001,Vente,202000,6,,RUE DU LANGUEDOC,0550,78840,78255,Freneuse,78,,,782550000E0364,,,,,,,,,,,,,0,1,Maison,66,4,S,sols,,,591,1.599017,49.034872
2019-1192628,2019-10-01,000001,Vente,195000,116,B,RUE CHARLES DE GAULLE,0180,78840,78255,Freneuse,78,,,782550000C0334,,,1,,2,92.93,6,92.93,7,92.93,8,92.93,5,1,Maison,90,3,,,,,,1.601282,49.048166
2019-1192867,2019-11-09,000001,Vente,104500,2,B,RUE HENRI BOUCAUT,0510,78840,78255,Freneuse,78,,,782550000C0509,,,,,,,,,,,,,0,1,Maison,47,2,S,sols,,,36,1.60174,49.049225
2019-1192867,2019-11-09,000001,Vente,104500,101,,RUE CHARLES DE GAULLE,0180,78840,78255,Freneuse,78,,,782550000C3030,,,,,,,,,,,,,0,,,,,S,sols,,,52,1.601844,49.049236
2019-1192919,2019-11-22,000001,Vente,37440,,,LES BOUDERIES,B015,78840,78255,Freneuse,78,,,782550000D0773,,,,,,,,,,,,,0,,,,,AB,terrains a bâtir,,,1200,1.606725,49.035624
2019-1193004,2019-11-28,000002,Vente,215000,31,B,RTE DEPARTEMENTALE 113,0720,78840,78255,Freneuse,78,,,782550000D0757,,,,,,,,,,,,,0,2,Appartement,75,4,,,,,,1.603163,49.032924
2019-1193004,2019-11-28,000002,Vente,215000,31,B,RTE DEPARTEMENTALE 113,0720,78840,78255,Freneuse,78,,,782550000D0757,,,,,,,,,,,,,0,1,Maison,102,6,,,,,,1.603163,49.032924
2019-1193004,2019-11-28,000002,Vente,215000,31,B,RTE DEPARTEMENTALE 113,0720,78840,78255,Freneuse,78,,,782550000D0757,,,,,,,,,,,,,0,2,Appartement,73,4,,,,,,1.603163,49.032924
2019-1193036,2019-12-17,000001,Vente,722000,39,B,RTE DEPARTEMENTALE 113,0720,78840,78255,Freneuse,78,,,782550000D0358,,,,,,,,,,,,,0,4,Local industriel. commercial ou assimilé,1150,0,T,terres,,,3071,1.604896,49.031999
2019-1193036,2019-12-17,000001,Vente,722000,39,B,RTE DEPARTEMENTALE 113,0720,78840,78255,Freneuse,78,,,782550000D0358,,,,,,,,,,,,,0,4,Local industriel. commercial ou assimilé,1150,0,S,sols,,,1000,1.604896,49.031999
2019-1193143,2019-12-04,000001,Vente en l'état futur d'achèvement,167000,,,LA RAVINE,B068,78840,78255,Freneuse,78,,,782550000C3740,,,13,,,,,,,,,,1,2,Appartement,63,3,,,,,,1.590963,49.040004
2019-1193143,2019-12-04,000001,Vente en l'état futur d'achèvement,167000,,,LA RAVINE,B068,78840,78255,Freneuse,78,,,782550000C3740,,,78,,,,,,,,,,1,3,Dépendance,,0,,,,,,1.590963,49.040004
2019-1193143,2019-12-04,000001,Vente en l'état futur d'achèvement,167000,,,LA RAVINE,B068,78840,78255,Freneuse,78,,,782550000C3740,,,36,,,,,,,,,,1,3,Dépendance,,0,,,,,,1.590963,49.040004
2019-1193242,2019-12-18,000002,Vente,360000,50,,RUE DU GEN LECLERC,0420,78840,78255,Freneuse,78,,,782550000C3852,,,,,,,,,,,,,0,1,Maison,146,7,S,sols,,,142,1.604896,49.044287
2019-1193242,2019-12-18,000002,Vente,360000,,,LES SENTIERS,B071,78840,78255,Freneuse,78,,,782550000C3853,,,,,,,,,,,,,0,,,,,S,sols,,,1131,1.604627,49.044386
2019-1193242,2019-12-18,000002,Vente,360000,,,LES SENTIERS,B071,78840,78255,Freneuse,78,,,782550000C3854,,,,,,,,,,,,,0,,,,,J,jardins,POTAG,Jardin potager,1203,1.604398,49.044121
2019-1193242,2019-12-18,000002,Vente,360000,,,LES SENTIERS,B071,78840,78255,Freneuse,78,,,782550000C3855,,,,,,,,,,,,,0,,,,,J,jardins,POTAG,Jardin potager,393,1.604478,49.044322
2019-1193247,2019-12-14,000002,Vente,8000,42,,RUE SOLANGE BOUTEL,0930,78840,78255,Freneuse,78,,,782550000C3831,,,,,,,,,,,,,0,,,,,S,sols,,,356,1.58654,49.039208
2019-1193293,2019-12-21,000001,Vente,103000,2,,RUE D'AUVERGNE,0070,78840,78255,Freneuse,78,,,782550000E0378,,,,,,,,,,,,,0,1,Maison,80,5,S,sols,,,647,1.598179,49.034602
2019-1193354,2019-04-03,000001,Adjudication,97000,12,,RUE DES DAGUENETS,0330,78840,78255,Freneuse,78,,,782550000C0585,,,,,,,,,,,,,0,1,Maison,48,3,S,sols,,,328,1.603247,49.049649
2019-1193354,2019-04-03,000001,Adjudication,97000,,,LE VILLAGE,B086,78840,78255,Freneuse,78,,,782550000C1308,,,,,,,,,,,,,0,,,,,J,jardins,POTAG,Jardin potager,496,1.603688,49.049446
