id_mutation,date_mutation,numero_disposition,nature_mutation,valeur_fonciere,adresse_numero,adresse_suffixe,adresse_nom_voie,adresse_code_voie,code_postal,code_commune,nom_commune,code_departement,ancien_code_commune,ancien_nom_commune,id_parcelle,ancien_id_parcelle,numero_volume,lot1_numero,lot1_surface_carrez,lot2_numero,lot2_surface_carrez,lot3_numero,lot3_surface_carrez,lot4_numero,lot4_surface_carrez,lot5_numero,lot5_surface_carrez,nombre_lots,code_type_local,type_local,surface_reelle_bati,nombre_pieces_principales,code_nature_culture,nature_culture,code_nature_culture_speciale,nature_culture_speciale,surface_terrain,longitude,latitude
2019-1198580,2019-02-08,000001,Vente,3500,,,LES TESSONNIERES,B087,79170,79111,Ensigné,79,,,79111000ZL0084,,,,,,,,,,,,,0,,,,,BT,taillis simples,,,5429,-0.284731,46.082597
2019-1199157,2019-01-30,000001,Vente,24000,11,,RUE DE LA SOURCE,0108,79170,79111,Ensigné,79,,,79111000ZD0128,,,,,,,,,,,,,0,1,Maison,64,3,S,sols,,,1076,-0.241074,46.088939
2019-1199346,2019-03-14,000001,Vente,1,4,,RUE DES TOURTERELLES,0120,79170,79111,Ensigné,79,,,79111000AB0307,,,,,,,,,,,,,0,3,Dépendance,,0,S,sols,,,146,-0.244791,46.087818
2019-1199510,2019-04-08,000001,Vente,28000,19,,RUE GRAND RUE LE BOURG,0055,79170,79111,Ensigné,79,,,79111000AB0080,,,,,,,,,,,,,0,1,Maison,120,5,S,sols,,,247,-0.242211,46.086287
2019-1199549,2019-04-02,000001,Vente,3823.2,,,LA COMMANDERIE,B034,79170,79111,Ensigné,79,,,79111000ZE0080,,,,,,,,,,,,,0,,,,,T,terres,,,6372,-0.251252,46.091065
2019-1199550,2019-04-02,000002,Vente,47195,,,LE BOIS D ENSIGNE SUD,B010,79170,79111,Ensigné,79,,,79111000AD0036,,,,,,,,,,,,,0,,,,,BT,taillis simples,,,8022,-0.270112,46.079596
2019-1199550,2019-04-02,000002,Vente,47195,,,LES CHAMBEAUX,B020,79170,79111,Ensigné,79,,,79111000ZC0026,,,,,,,,,,,,,0,,,,,T,terres,,,840,-0.241556,46.090041
2019-1199550,2019-04-02,000002,Vente,47195,,,L ORMEAU,B065,79170,79111,Ensigné,79,,,79111000ZD0069,,,,,,,,,,,,,0,,,,,P,prés,,,1465,-0.237474,46.089246
2019-1199550,2019-04-02,000002,Vente,47195,,,L ORMEAU,B065,79170,79111,Ensigné,79,,,79111000ZD0081,,,,,,,,,,,,,0,,,,,T,terres,,,5665,-0.237071,46.089875
2019-1199550,2019-04-02,000002,Vente,47195,,,LA COMMANDERIE,B034,79170,79111,Ensigné,79,,,79111000ZE0032,,,,,,,,,,,,,0,,,,,T,terres,,,15595,-0.248307,46.092414
2019-1199550,2019-04-02,000002,Vente,47195,,,LA COMMANDERIE,B034,79170,79111,Ensigné,79,,,79111000ZE0082,,,,,,,,,,,,,0,,,,,BT,taillis simples,,,12364,-0.247314,46.090926
2019-1199550,2019-04-02,000002,Vente,47195,,,LA GLACIERE,B056,79170,79111,Ensigné,79,,,79111000ZE0084,,,,,,,,,,,,,0,,,,,T,terres,,,45821,-0.247716,46.089908
2019-1199550,2019-04-02,000002,Vente,47195,,,CHAMP ROUILLON,B022,79170,79111,Ensigné,79,,,79111000ZH0073,,,,,,,,,,,,,0,,,,,T,terres,,,6908,-0.247855,46.077709
2019-1199550,2019-04-02,000002,Vente,47195,,,CHAMP ROUILLON,B022,79170,79111,Ensigné,79,,,79111000ZH0073,,,,,,,,,,,,,0,,,,,VI,vignes,,,2722,-0.247855,46.077709
2019-1199550,2019-04-02,000002,Vente,47195,,,LA VALLEE DE CHIZE,B091,79170,79111,Ensigné,79,,,79111000ZM0011,,,,,,,,,,,,,0,,,,,BT,taillis simples,,,3540,-0.2662,46.092015
2019-1199550,2019-04-02,000002,Vente,47195,,,LA RIVIERE,B076,79170,79111,Ensigné,79,,,79111000ZO0104,,,,,,,,,,,,,0,,,,,T,terres,,,1500,-0.263516,46.098376
2019-1199550,2019-04-02,000002,Vente,47195,,,LA RIVIERE,B076,79170,79111,Ensigné,79,,,79111000ZO0105,,,,,,,,,,,,,0,,,,,T,terres,,,240,-0.263722,46.098267
2019-1199550,2019-04-02,000002,Vente,47195,,,LA RIVIERE,B076,79170,79111,Ensigné,79,,,79111000ZO0120,,,,,,,,,,,,,0,,,,,T,terres,,,11600,-0.266954,46.098781
2019-1199557,2019-04-02,000001,Vente,8599.5,,,LA COMMANDERIE,B034,79170,79111,Ensigné,79,,,79111000ZE0030,,,,,,,,,,,,,0,,,,,BT,taillis simples,,,33075,-0.249491,46.091869
2019-1199592,2019-04-02,000002,Vente,82857.8,2,,LA COMMANDERIE,B034,79170,79111,Ensigné,79,,,79111000ZE0028,,,,,,,,,,,,,0,1,Maison,75,1,S,sols,,,3115,-0.249705,46.091437
2019-1199592,2019-04-02,000002,Vente,82857.8,,,LA COMMANDERIE,B034,79170,79111,Ensigné,79,,,79111000ZE0029,,,,,,,,,,,,,0,,,,,J,jardins,,,1090,-0.250011,46.091801
2019-1199592,2019-04-02,000002,Vente,82857.8,,,LA GLACIERE,B056,79170,79111,Ensigné,79,,,79111000ZE0034,,,,,,,,,,,,,0,,,,,S,sols,,,62,-0.250101,46.090385
2019-1199592,2019-04-02,000002,Vente,82857.8,,,LA COMMANDERIE,B034,79170,79111,Ensigné,79,,,79111000ZE0081,,,,,,,,,,,,,0,,,,,BT,taillis simples,,,8746,-0.248457,46.091155
2019-1199598,2019-04-02,000001,Vente,13450,,,LE BOIS D ENSIGNE SUD,B010,79170,79111,Ensigné,79,,,79111000AD0067,,,,,,,,,,,,,0,,,,,BT,taillis simples,,,25381,-0.26782,46.075761
2019-1199598,2019-04-02,000001,Vente,13450,,,LA COMMANDERIE,B034,79170,79111,Ensigné,79,,,79111000ZE0031,,,,,,,,,,,,,0,,,,,T,terres,,,8550,-0.250283,46.093348
2019-1199598,2019-04-02,000001,Vente,13450,,,LE TAILLIS GIRAUDEAU,B084,79170,79111,Ensigné,79,,,79111000ZH0304,,,,,,,,,,,,,0,,,,,BT,taillis simples,,,3268,-0.2612,46.077426
2019-1203234,2019-09-10,000001,Vente,60000,15,,RUE GRAND RUE LE BOURG,0055,79170,79111,Ensigné,79,,,79111000AB0229,,,,,,,,,,,,,0,1,Maison,160,4,S,sols,,,2346,-0.241378,46.086543
2019-1203234,2019-09-10,000001,Vente,60000,,,LE BOURG,B015,79170,79111,Ensigné,79,,,79111000AB0231,,,,,,,,,,,,,0,,,,,S,sols,,,178,-0.241817,46.086235
2019-1203893,2019-10-10,000001,Vente,6046,,,CHINETROTE,B030,79170,79111,Ensigné,79,,,79111000ZP0002,,,,,,,,,,,,,0,,,,,T,terres,,,13437,-0.265795,46.108004
2019-1205007,2019-11-12,000001,Vente,67000,,,ARSANGES,B002,79170,79111,Ensigné,79,,,79111000AH0077,,,,,,,,,,,,,0,,,,,J,jardins,,,356,-0.279938,46.089686
2019-1205007,2019-11-12,000001,Vente,67000,8,,RUE PRINCIPALE  ARSANGES,0090,79170,79111,Ensigné,79,,,79111000AH0078,,,,,,,,,,,,,0,1,Maison,105,3,S,sols,,,1775,-0.280028,46.08986
2019-1205007,2019-11-12,000001,Vente,67000,,,ARSANGES,B002,79170,79111,Ensigné,79,,,79111000AH0103,,,,,,,,,,,,,0,,,,,J,jardins,,,323,-0.279746,46.09002
2019-1206290,2019-12-30,000001,Vente,14000,9001,,RUE DE LA POMPE  ARSANGES,0085,79170,79111,Ensigné,79,,,79111000AH0036,,,,,,,,,,,,,0,1,Maison,58,1,S,sols,,,268,-0.27877,46.090608
2019-1206290,2019-12-30,000001,Vente,14000,,,ARSANGES,B002,79170,79111,Ensigné,79,,,79111000AH0037,,,,,,,,,,,,,0,,,,,S,sols,,,55,-0.278597,46.090578
2019-1206290,2019-12-30,000001,Vente,14000,,,ARSANGES,B002,79170,79111,Ensigné,79,,,79111000AH0038,,,,,,,,,,,,,0,,,,,S,sols,,,60,-0.278631,46.090527
