id_mutation,date_mutation,numero_disposition,nature_mutation,valeur_fonciere,adresse_numero,adresse_suffixe,adresse_nom_voie,adresse_code_voie,code_postal,code_commune,nom_commune,code_departement,ancien_code_commune,ancien_nom_commune,id_parcelle,ancien_id_parcelle,numero_volume,lot1_numero,lot1_surface_carrez,lot2_numero,lot2_surface_carrez,lot3_numero,lot3_surface_carrez,lot4_numero,lot4_surface_carrez,lot5_numero,lot5_surface_carrez,nombre_lots,code_type_local,type_local,surface_reelle_bati,nombre_pieces_principales,code_nature_culture,nature_culture,code_nature_culture_speciale,nature_culture_speciale,surface_terrain,longitude,latitude
2019-1198363,2019-01-23,000001,Vente,7400,1,,IMP DU BOIS GIGOT,0298,79190,79136,Alloinay,79,,,791360060C0118,,,,,,,,,,,,,0,1,Maison,50,2,S,sols,,,190,-0.010321,46.16297
2019-1198377,2019-01-23,000001,Vente,40975,,,LES BEAUCHAMPS,B180,79190,79136,Alloinay,79,,,791360060C0013,,,,,,,,,,,,,0,,,,,T,terres,,,2425,-0.024983,46.15587
2019-1198377,2019-01-23,000001,Vente,40975,,,LES BEAUCHAMPS,B180,79190,79136,Alloinay,79,,,791360060C0014,,,,,,,,,,,,,0,,,,,T,terres,,,3275,-0.02519,46.156
2019-1198377,2019-01-23,000001,Vente,40975,,,LES BEAUCHAMPS,B180,79190,79136,Alloinay,79,,,791360060C0015,,,,,,,,,,,,,0,,,,,T,terres,,,3755,-0.024181,46.15692
2019-1198377,2019-01-23,000001,Vente,40975,,,LA SOUCHE,B221,79190,79136,Alloinay,79,,,791360060C0053,,,,,,,,,,,,,0,,,,,T,terres,,,2910,-0.025521,46.160435
2019-1198377,2019-01-23,000001,Vente,40975,,,LA GRANDE TRANCHEE ALLEUDS,B204,79190,79136,Alloinay,79,,,791360060C0350,,,,,,,,,,,,,0,,,,,T,terres,,,5240,-0.022726,46.150899
2019-1198377,2019-01-23,000001,Vente,40975,,,LA GRANDE TRANCHEE ALLEUDS,B204,79190,79136,Alloinay,79,,,791360060C0352,,,,,,,,,,,,,0,,,,,T,terres,,,970,-0.022944,46.150453
2019-1198377,2019-01-23,000001,Vente,40975,,,LES RANGIERES,B125,79110,79136,Alloinay,79,,,79136151ZL0023,,,,,,,,,,,,,0,,,,,T,terres,,,5000,-0.021651,46.149405
2019-1198377,2019-01-23,000001,Vente,40975,,,LES RANGIERES,B125,79110,79136,Alloinay,79,,,79136151ZL0023,,,,,,,,,,,,,0,,,,,T,terres,,,21551,-0.021651,46.149405
2019-1198377,2019-01-23,000001,Vente,40975,,,LES RANGIERES,B125,79110,79136,Alloinay,79,,,79136151ZL0023,,,,,,,,,,,,,0,,,,,T,terres,,,21550,-0.021651,46.149405
2019-1198377,2019-01-23,000001,Vente,40975,,,LA GRANDE BROUSSE,B073,79110,79136,Alloinay,79,,,79136000ZH0037,,,,,,,,,,,,,0,,,,,T,terres,,,24131,-0.043369,46.154747
2019-1198377,2019-01-23,000001,Vente,40975,,,LA GRANDE BROUSSE,B073,79110,79136,Alloinay,79,,,79136000ZH0037,,,,,,,,,,,,,0,,,,,T,terres,,,24130,-0.043369,46.154747
2019-1198380,2019-01-23,000001,Vente,15000,,,LES GRANDES GROIES,B206,79190,79136,Alloinay,79,,,791360060D0138,,,,,,,,,,,,,0,,,,,T,terres,,,43780,-0.045661,46.149117
2019-1198505,2019-01-30,000001,Vente,4678,,,BOIS DU JUGE,B184,79190,79136,Alloinay,79,,,791360060B0404,,,,,,,,,,,,,0,,,,,BT,taillis simples,,,2640,0.006089,46.153088
2019-1198539,2019-01-26,000001,Vente,5000,,,LE PATIS MOULIN,B099,79110,79136,Alloinay,79,,,79136151ZB0025,,,,,,,,,,,,,0,,,,,T,terres,,,5130,-0.038366,46.117401
2019-1198539,2019-01-26,000001,Vente,5000,,,LE PATIS MOULIN,B099,79110,79136,Alloinay,79,,,79136151ZB0026,,,,,,,,,,,,,0,,,,,T,terres,,,9130,-0.038999,46.117887
2019-1198545,2019-01-26,000001,Vente,5000,,,PIECE DE LA NAIDE,B112,79110,79136,Alloinay,79,,,79136000ZI0004,,,,,,,,,,,,,0,,,,,T,terres,,,14760,-0.061437,46.136395
2019-1198579,2019-02-08,000001,Vente,8000,,,LES NOYERS,B093,79110,79136,Alloinay,79,,,791361510A0419,,,,,,,,,,,,,0,,,,,T,terres,,,5360,-0.031433,46.135633
2019-1198579,2019-02-08,000001,Vente,8000,,,LES NOYERS,B093,79110,79136,Alloinay,79,,,791361510A0419,,,,,,,,,,,,,0,,,,,T,terres,,,5360,-0.031433,46.135633
2019-1198579,2019-02-08,000001,Vente,8000,,,LES NOYERS,B093,79110,79136,Alloinay,79,,,791361510A0420,,,,,,,,,,,,,0,,,,,T,terres,,,5035,-0.032443,46.134682
2019-1198579,2019-02-08,000001,Vente,8000,,,LES NOYERS,B093,79110,79136,Alloinay,79,,,791361510A0420,,,,,,,,,,,,,0,,,,,T,terres,,,5035,-0.032443,46.134682
2019-1198792,2019-02-13,000001,Vente,140000,,,BUFFEVENT,B151,79110,79136,Alloinay,79,,,791360000A0047,,,,,,,,,,,,,0,,,,,J,jardins,,,50,-0.078647,46.140277
2019-1198792,2019-02-13,000001,Vente,140000,5,,CHE DES ARTISTES,0003,79110,79136,Alloinay,79,,,791360000A0049,,,,,,,,,,,,,0,1,Maison,110,3,S,sols,,,499,-0.078467,46.140404
2019-1198792,2019-02-13,000001,Vente,140000,,,BUFFEVENT,B151,79110,79136,Alloinay,79,,,791360000A0050,,,,,,,,,,,,,0,,,,,S,sols,,,39,-0.078351,46.140447
2019-1198792,2019-02-13,000001,Vente,140000,,,BUFFEVENT,B151,79110,79136,Alloinay,79,,,791360000A0051,,,,,,,,,,,,,0,,,,,S,sols,,,39,-0.078316,46.140492
2019-1198792,2019-02-13,000001,Vente,140000,,,BUFFEVENT,B151,79110,79136,Alloinay,79,,,791360000A0052,,,,,,,,,,,,,0,,,,,S,sols,,,50,-0.078377,46.140544
2019-1199150,2019-03-07,000001,Vente,3000,,,GRAND CHAMP,B202,79190,79136,Alloinay,79,,,791360060B0020,,,,,,,,,,,,,0,,,,,T,terres,,,7500,0.011793,46.162724
2019-1199332,2019-03-14,000001,Vente,350,,,LES FOLLES,B060,79110,79136,Alloinay,79,,,791361510B0288,,,,,,,,,,,,,0,,,,,BT,taillis simples,,,516,-0.018154,46.149336
2019-1199332,2019-03-14,000001,Vente,350,,,BOIS BAGE,B005,79110,79136,Alloinay,79,,,791360000C0309,,,,,,,,,,,,,0,,,,,BT,taillis simples,,,1265,-0.047709,46.173265
2019-1199350,2019-03-18,000001,Vente,102000,,,LA COUSSARDIERE,B198,79190,79136,Alloinay,79,,,791360060B0073,,,,,,,,,,,,,0,,,,,J,jardins,,,605,0.007417,46.161623
2019-1199350,2019-03-18,000001,Vente,102000,2,,RUE DE LA MARE,0312,79190,79136,Alloinay,79,,,791360060B0075,,,,,,,,,,,,,0,1,Maison,96,4,S,sols,,,1002,0.007575,46.161309
2019-1199350,2019-03-18,000001,Vente,102000,,,LA COUSSARDIERE,B198,79190,79136,Alloinay,79,,,791360060B0077,,,,,,,,,,,,,0,,,,,S,sols,,,66,0.007788,46.161228
2019-1199350,2019-03-18,000001,Vente,102000,,,LA COUSSARDIERE,B198,79190,79136,Alloinay,79,,,791360060B0634,,,,,,,,,,,,,0,,,,,J,jardins,,,1198,0.007189,46.161365
2019-1199350,2019-03-18,000001,Vente,102000,,,LA COUSSARDIERE,B198,79190,79136,Alloinay,79,,,791360060B0637,,,,,,,,,,,,,0,,,,,S,sols,,,19,0.007547,46.161194
2019-1199350,2019-03-18,000001,Vente,102000,,,LA COUSSARDIERE,B198,79190,79136,Alloinay,79,,,791360060B0638,,,,,,,,,,,,,0,,,,,S,sols,,,16,0.007685,46.161195
2019-1199350,2019-03-18,000001,Vente,102000,,,LA COUSSARDIERE,B198,79190,79136,Alloinay,79,,,791360060B0640,,,,,,,,,,,,,0,,,,,S,sols,,,32,0.007337,46.161198
2019-1200072,2019-05-03,000001,Vente,33320,,,BATAILLE,B003,79110,79136,Alloinay,79,,,791360000E0007,,,,,,,,,,,,,0,,,,,S,sols,,,860,-0.037882,46.168002
2019-1200072,2019-05-03,000001,Vente,33320,,,BATAILLE,B003,79110,79136,Alloinay,79,,,791360000E0302,,,,,,,,,,,,,0,,,,,T,terres,,,805,-0.038502,46.167956
2019-1200072,2019-05-03,000001,Vente,33320,,,BATAILLE,B003,79110,79136,Alloinay,79,,,791360000E0303,,,,,,,,,,,,,0,,,,,T,terres,,,510,-0.038547,46.168122
2019-1200116,2019-05-21,000001,Vente,12400,2,,IMP DU BOIS GIGOT,0298,79190,79136,Alloinay,79,,,791360060C0108,,,,,,,,,,,,,0,1,Maison,180,5,S,sols,,,1615,-0.010786,46.162789
2019-1200116,2019-05-21,000001,Vente,12400,,,LA BOURIE,B188,79190,79136,Alloinay,79,,,791360060C0109,,,,,,,,,,,,,0,,,,,T,terres,,,805,-0.011003,46.162278
2019-1200116,2019-05-21,000001,Vente,12400,,,LA BOURIE,B188,79190,79136,Alloinay,79,,,791360060C0110,,,,,,,,,,,,,0,,,,,T,terres,,,480,-0.011342,46.161795
2019-1200116,2019-05-21,000001,Vente,12400,,,LA BOURIE,B188,79190,79136,Alloinay,79,,,791360060C0111,,,,,,,,,,,,,0,,,,,T,terres,,,7070,-0.010933,46.161602
2019-1200403,2019-05-20,000001,Vente,18550,,,BATAILLE,B003,79110,79136,Alloinay,79,,,791360000E0007,,,,,,,,,,,,,0,,,,,S,sols,,,860,-0.037882,46.168002
2019-1200537,2019-06-19,000001,Vente,8000,,,LA RIVIERE,B128,79110,79136,Alloinay,79,,,79136151ZA0055,,,,,,,,,,,,,0,,,,,J,jardins,,,639,-0.023269,46.128021
2019-1200537,2019-06-19,000001,Vente,8000,,,LA RIVIERE,B128,79110,79136,Alloinay,79,,,79136151ZA0056,,,,,,,,,,,,,0,,,,,J,jardins,,,388,-0.023472,46.128032
2019-1201387,2019-07-19,000001,Vente,2050,,,BUFFEVENT,B151,79110,79136,Alloinay,79,,,791360000A0064,,,,,,,,,,,,,0,,,,,T,terres,,,481,-0.076875,46.139698
2019-1201689,2019-07-29,000001,Vente,20900,,,LES BEAUCHAMPS,B180,79190,79136,Alloinay,79,,,791360060C0013,,,,,,,,,,,,,0,,,,,T,terres,,,2425,-0.024983,46.15587
2019-1201689,2019-07-29,000001,Vente,20900,,,LES BEAUCHAMPS,B180,79190,79136,Alloinay,79,,,791360060C0014,,,,,,,,,,,,,0,,,,,T,terres,,,3275,-0.02519,46.156
2019-1201689,2019-07-29,000001,Vente,20900,,,LES BEAUCHAMPS,B180,79190,79136,Alloinay,79,,,791360060C0015,,,,,,,,,,,,,0,,,,,T,terres,,,3755,-0.024181,46.15692
2019-1201689,2019-07-29,000001,Vente,20900,,,LES GRANDES GROIES,B206,79190,79136,Alloinay,79,,,791360060D0138,,,,,,,,,,,,,0,,,,,T,terres,,,43780,-0.045661,46.149117
2019-1201693,2019-07-29,000001,Vente,20200,,,LA SOUCHE,B221,79190,79136,Alloinay,79,,,791360060C0053,,,,,,,,,,,,,0,,,,,T,terres,,,2910,-0.025521,46.160435
2019-1201693,2019-07-29,000001,Vente,20200,,,LA GRANDE BROUSSE,B073,79110,79136,Alloinay,79,,,79136000ZH0037,,,,,,,,,,,,,0,,,,,T,terres,,,24130,-0.043369,46.154747
2019-1201693,2019-07-29,000001,Vente,20200,,,LA GRANDE BROUSSE,B073,79110,79136,Alloinay,79,,,79136000ZH0037,,,,,,,,,,,,,0,,,,,T,terres,,,24131,-0.043369,46.154747
2019-1201695,2019-07-29,000001,Vente,21400,,,LA GRANDE TRANCHEE ALLEUDS,B204,79190,79136,Alloinay,79,,,791360060C0350,,,,,,,,,,,,,0,,,,,T,terres,,,5240,-0.022726,46.150899
2019-1201695,2019-07-29,000001,Vente,21400,,,LA GRANDE TRANCHEE ALLEUDS,B204,79190,79136,Alloinay,79,,,791360060C0352,,,,,,,,,,,,,0,,,,,T,terres,,,970,-0.022944,46.150453
2019-1201695,2019-07-29,000001,Vente,21400,,,LES RANGIERES,B125,79110,79136,Alloinay,79,,,79136151ZL0023,,,,,,,,,,,,,0,,,,,T,terres,,,21550,-0.021651,46.149405
2019-1201695,2019-07-29,000001,Vente,21400,,,LES RANGIERES,B125,79110,79136,Alloinay,79,,,79136151ZL0023,,,,,,,,,,,,,0,,,,,T,terres,,,21551,-0.021651,46.149405
2019-1201695,2019-07-29,000001,Vente,21400,,,LES RANGIERES,B125,79110,79136,Alloinay,79,,,79136151ZL0023,,,,,,,,,,,,,0,,,,,T,terres,,,5000,-0.021651,46.149405
2019-1203210,2019-09-10,000001,Vente,18000,6,B,RTE DE LA BOUCLIERE BAS GOURNA,0015,79110,79136,Alloinay,79,,,791360000B0858,,,,,,,,,,,,,0,,,,,S,sols,,,1473,-0.066183,46.154018
2019-1203210,2019-09-10,000001,Vente,18000,,,CHAUVET,B039,79110,79136,Alloinay,79,,,791360000B0859,,,,,,,,,,,,,0,,,,,S,sols,,,7,-0.066236,46.153698
2019-1203210,2019-09-10,000001,Vente,18000,6,,RTE DE LA BOUCLIERE BAS GOURNA,0015,79110,79136,Alloinay,79,,,791360000B0863,,,,,,,,,,,,,0,,,,,S,sols,,,179,-0.066046,46.154
2019-1203648,2019-10-03,000001,Vente,48450,2,,CHEM DES VAUX BUFFEVENT,0280,79110,79136,Alloinay,79,,,791360000A0074,,,,,,,,,,,,,0,1,Maison,61,2,S,sols,,,732,-0.077895,46.140944
2019-1203648,2019-10-03,000001,Vente,48450,,,LES COUARDES,B049,79110,79136,Alloinay,79,,,79136000ZM0029,,,,,,,,,,,,,0,,,,,T,terres,,,203,-0.080447,46.140002
2019-1203648,2019-10-03,000001,Vente,48450,,,LES COUARDES,B049,79110,79136,Alloinay,79,,,79136000ZM0030,,,,,,,,,,,,,0,,,,,T,terres,,,932,-0.080619,46.140022
2019-1204433,2019-10-15,000001,Vente,1,,,LA PETITE TRANCHEE,B214,79190,79136,Alloinay,79,,,791360060B0671,,,,,,,,,,,,,0,,,,,S,sols,,,23,-0.013152,46.15341
2019-1204433,2019-10-15,000001,Vente,1,2,,CHE DE LA VALLEE LES ALLEUDS,0325,79190,79136,Alloinay,79,,,791360060B0673,,,,,,,,,,,,,0,,,,,S,sols,,,30,-0.013208,46.153414
2019-1204935,2019-10-28,000001,Vente,175000,,,CHAUVET,B039,79110,79136,Alloinay,79,,,791360000B0400,,,,,,,,,,,,,0,,,,,T,terres,,,2180,-0.06722,46.154496
2019-1204935,2019-10-28,000001,Vente,175000,,,CHAUVET,B039,79110,79136,Alloinay,79,,,791360000B0653,,,,,,,,,,,,,0,,,,,S,sols,,,90,-0.06774,46.154397
2019-1204935,2019-10-28,000001,Vente,175000,12,,RTE DE LA BOUCLIERE BAS GOURNA,0015,79110,79136,Alloinay,79,,,791360000B0828,,,,,,,,,,,,,0,1,Maison,170,6,S,sols,,,5260,-0.067645,46.154324
2019-1204935,2019-10-28,000001,Vente,175000,,,CHAUVET,B039,79110,79136,Alloinay,79,,,791360000B0831,,,,,,,,,,,,,0,,,,,J,jardins,,,466,-0.068069,46.153956
2019-1205367,2019-12-04,000001,Vente,12000,11,,RUE DES NOYERS LOIZE,0190,79110,79136,Alloinay,79,,,791361510E0037,,,,,,,,,,,,,0,1,Maison,50,3,S,sols,,,267,-0.036658,46.133248
2019-1205367,2019-12-04,000001,Vente,12000,,,LE BOURG DE LOIZE,B090,79110,79136,Alloinay,79,,,791361510E0039,,,,,,,,,,,,,0,,,,,J,jardins,,,410,-0.036273,46.133604
2019-1205382,2019-12-03,000001,Echange,12000,,,LA GRENETRIE,B084,79110,79136,Alloinay,79,,,79136000ZO0070,,,,,,,,,,,,,0,,,,,T,terres,,,7860,-0.069665,46.156386
2019-1205382,2019-12-03,000001,Echange,12000,,,HAUT DES VALLEES,B088,79110,79136,Alloinay,79,,,79136000ZO0073,,,,,,,,,,,,,0,,,,,T,terres,,,3121,-0.070148,46.155254
2019-1205382,2019-12-03,000001,Echange,12000,,,HAUT DES VALLEES,B088,79110,79136,Alloinay,79,,,79136000ZO0074,,,,,,,,,,,,,0,,,,,T,terres,,,8433,-0.0689,46.154807
2019-1205382,2019-12-03,000002,Echange,12000,,,LES GRANDES VERSENNES,B080,79110,79136,Alloinay,79,,,79136000ZO0004,,,,,,,,,,,,,0,,,,,T,terres,,,22392,-0.074016,46.155157
2019-1205382,2019-12-03,000002,Echange,12000,,,LES GRANDES VERSENNES,B080,79110,79136,Alloinay,79,,,79136000ZO0004,,,,,,,,,,,,,0,,,,,T,terres,,,22391,-0.074016,46.155157
2019-1205753,2019-12-09,000001,Vente,140000,5020,,RUE DE LA MAIRIE LOIZE,0160,79110,79136,Alloinay,79,,,791361510E0092,,,,,,,,,,,,,0,1,Maison,105,5,S,sols,,,705,-0.03745,46.132551
2019-1205753,2019-12-09,000001,Vente,140000,,,LE BOURG DE LOIZE,B090,79110,79136,Alloinay,79,,,791361510E0093,,,,,,,,,,,,,0,,,,,J,jardins,,,1019,-0.037397,46.132187
2019-1205753,2019-12-09,000001,Vente,140000,,,LE BOURG DE LOIZE,B090,79110,79136,Alloinay,79,,,791361510E0093,,,,,,,,,,,,,0,,,,,S,sols,,,211,-0.037397,46.132187
2019-1205753,2019-12-09,000001,Vente,140000,,,LE BOURG DE LOIZE,B090,79110,79136,Alloinay,79,,,791361510E0305,,,,,,,,,,,,,0,,,,,S,sols,,,735,-0.037206,46.132049
2019-1205753,2019-12-09,000001,Vente,140000,1,,RUE DE LA MAIRIE LOIZE,0160,79110,79136,Alloinay,79,,,791361510E0348,,,,,,,,,,,,,0,,,,,S,sols,,,144,-0.037293,46.132544
2019-1205753,2019-12-09,000001,Vente,140000,1,,RUE DE LA MAIRIE LOIZE,0160,79110,79136,Alloinay,79,,,791361510E0349,,,,,,,,,,,,,0,,,,,S,sols,,,111,-0.037042,46.132248
2019-1206271,2019-12-20,000001,Vente,50000,4,,IMP DES TERTRES LOIZE,0255,79110,79136,Alloinay,79,,,791361510E0043,,,,,,,,,,,,,0,1,Maison,110,3,S,sols,,,1455,-0.036372,46.134104
2019-1206271,2019-12-20,000001,Vente,50000,,,LE BOURG DE LOIZE,B090,79110,79136,Alloinay,79,,,791361510E0044,,,,,,,,,,,,,0,,,,,J,jardins,,,2395,-0.036249,46.134405
