id_mutation,date_mutation,numero_disposition,nature_mutation,valeur_fonciere,adresse_numero,adresse_suffixe,adresse_nom_voie,adresse_code_voie,code_postal,code_commune,nom_commune,code_departement,ancien_code_commune,ancien_nom_commune,id_parcelle,ancien_id_parcelle,numero_volume,lot1_numero,lot1_surface_carrez,lot2_numero,lot2_surface_carrez,lot3_numero,lot3_surface_carrez,lot4_numero,lot4_surface_carrez,lot5_numero,lot5_surface_carrez,nombre_lots,code_type_local,type_local,surface_reelle_bati,nombre_pieces_principales,code_nature_culture,nature_culture,code_nature_culture_speciale,nature_culture_speciale,surface_terrain,longitude,latitude
2019-1198945,2019-02-13,000001,Echange,2000,,,LA BATONNIERE,B001,79220,79241,Saint-Christophe-sur-Roc,79,,,792410000A0474,,,,,,,,,,,,,0,,,,,T,terres,,,7760,-0.368015,46.454125
2019-1198945,2019-02-13,000001,Echange,2000,,,PLATEAU DE MONTPLAISIR,B029,79220,79241,Saint-Christophe-sur-Roc,79,,,792410000A0737,,,,,,,,,,,,,0,,,,,T,terres,,,1927,-0.362837,46.45956
2019-1198945,2019-02-13,000001,Echange,2000,,,PLATEAU DE MONTPLAISIR,B029,79220,79241,Saint-Christophe-sur-Roc,79,,,792410000A0876,,,,,,,,,,,,,0,,,,,T,terres,,,1838,-0.363345,46.46004
2019-1198945,2019-02-13,000001,Echange,2000,,,PLATEAU DE MONTPLAISIR,B029,79220,79241,Saint-Christophe-sur-Roc,79,,,792410000A0877,,,,,,,,,,,,,0,,,,,P,prés,,,3770,-0.363439,46.459908
2019-1198945,2019-02-13,000002,Echange,2000,,,LA BATONNIERE,B001,79220,79241,Saint-Christophe-sur-Roc,79,,,792410000A0474,,,,,,,,,,,,,0,,,,,T,terres,,,7760,-0.368015,46.454125
2019-1199080,2019-03-01,000001,Vente,1500,,,LA BERNIERE,B002,79220,79241,Saint-Christophe-sur-Roc,79,,,792410000C0795,,,,,,,,,,,,,0,,,,,T,terres,,,5190,-0.348877,46.450107
2019-1199342,2019-03-14,000001,Vente,2000,4,,CHEM DE LA GELOUSIERE,0085,79220,79241,Saint-Christophe-sur-Roc,79,,,79241000AC0148,,,,,,,,,,,,,0,,,,,S,sols,,,16,-0.349053,46.446008
2019-1199342,2019-03-14,000001,Vente,2000,,,LE BOURG,B004,79220,79241,Saint-Christophe-sur-Roc,79,,,79241000AC0151,,,,,,,,,,,,,0,,,,,AG,terrains d'agrément,,,300,-0.348864,46.445965
2019-1199668,2019-04-03,000001,Vente,13500,,,LES OEULIS,B024,79220,79241,Saint-Christophe-sur-Roc,79,,,792410000B0010,,,,,,,,,,,,,0,,,,,T,terres,,,15410,-0.3796,46.445508
2019-1199668,2019-04-03,000001,Vente,13500,,,LA GRANDE GASSE,B018,79220,79241,Saint-Christophe-sur-Roc,79,,,792410000B0129,,,,,,,,,,,,,0,,,,,T,terres,,,20880,-0.375102,46.447567
2019-1199668,2019-04-03,000001,Vente,13500,,,BOISNE,B003,79220,79241,Saint-Christophe-sur-Roc,79,,,792410000B0499,,,,,,,,,,,,,0,,,,,T,terres,,,1680,-0.363471,46.439832
2019-1199668,2019-04-03,000001,Vente,13500,,,BOISNE,B003,79220,79241,Saint-Christophe-sur-Roc,79,,,792410000B0501,,,,,,,,,,,,,0,,,,,T,terres,,,1390,-0.363359,46.439461
2019-1199668,2019-04-03,000001,Vente,13500,,,BOISNE,B003,79220,79241,Saint-Christophe-sur-Roc,79,,,792410000B0508,,,,,,,,,,,,,0,,,,,T,terres,,,5600,-0.36349,46.438462
2019-1199740,2019-02-13,000001,Vente,1811.5,,,LA BATONNIERE,B001,79220,79241,Saint-Christophe-sur-Roc,79,,,792410000A0874,,,,,,,,,,,,,0,,,,,T,terres,,,3623,-0.367838,46.457909
2019-1199965,2019-04-30,000001,Vente,45000,5,,RUE DE LA CROIX,0030,79220,79241,Saint-Christophe-sur-Roc,79,,,79241000AC0129,,,,,,,,,,,,,0,1,Maison,108,3,S,sols,,,153,-0.348329,46.446734
2019-1200523,2019-06-04,000001,Vente,1650,,,LE BOURG,B004,79220,79241,Saint-Christophe-sur-Roc,79,,,79241000AC0059,,,,,,,,,,,,,0,,,,,J,jardins,,,355,-0.345586,46.447737
2019-1200611,2019-06-14,000001,Vente,30014,9,,RUE DU FOMBRELLIER,0053,79220,79241,Saint-Christophe-sur-Roc,79,,,79241000AB0088,,,,,,,,,,,,,0,,,,,AB,terrains a bâtir,,,580,-0.353996,46.448728
2019-1201317,2019-07-04,000001,Vente,126000,2,,PL DE L EGLISE,0040,79220,79241,Saint-Christophe-sur-Roc,79,,,79241000AC0035,,,,,,,,,,,,,0,1,Maison,89,3,S,sols,,,392,-0.347398,46.446643
2019-1201318,2019-07-04,000001,Vente,1500,,,COTEAUX DE L EPAVE,B013,79220,79241,Saint-Christophe-sur-Roc,79,,,792410000C0254,,,,,,,,,,,,,0,,,,,T,terres,,,2357,-0.34879,46.442684
2019-1201318,2019-07-04,000001,Vente,1500,,,COTEAUX DE L EPAVE,B013,79220,79241,Saint-Christophe-sur-Roc,79,,,792410000C0950,,,,,,,,,,,,,0,,,,,S,sols,,,1000,-0.348837,46.442186
2019-1201318,2019-07-04,000001,Vente,1500,,,COTEAUX DE L EPAVE,B013,79220,79241,Saint-Christophe-sur-Roc,79,,,792410000C0950,,,,,,,,,,,,,0,,,,,T,terres,,,1943,-0.348837,46.442186
2019-1201384,2019-07-18,000001,Vente,35000,5,,PL DE L EGLISE,0040,79220,79241,Saint-Christophe-sur-Roc,79,,,79241000AC0132,,,,,,,,,,,,,0,1,Maison,79,3,S,sols,,,162,-0.348013,46.446984
2019-1203143,2019-09-10,000001,Vente,8500,,,LA GALINIERE,B016,79220,79241,Saint-Christophe-sur-Roc,79,,,79241000AC0069,,,,,,,,,,,,,0,,,,,VI,vignes,,,556,-0.344076,46.448691
2019-1203143,2019-09-10,000001,Vente,8500,,,LES COMBES,B012,79220,79241,Saint-Christophe-sur-Roc,79,,,792410000C0334,,,,,,,,,,,,,0,,,,,P,prés,,,2690,-0.345007,46.446493
2019-1203143,2019-09-10,000001,Vente,8500,,,LA GALINIERE,B016,79220,79241,Saint-Christophe-sur-Roc,79,,,792410000C0349,,,,,,,,,,,,,0,,,,,P,prés,,,9647,-0.343664,46.449647
2019-1203143,2019-09-10,000001,Vente,8500,,,LA GALINIERE,B016,79220,79241,Saint-Christophe-sur-Roc,79,,,792410000C0350,,,,,,,,,,,,,0,,,,,T,terres,,,905,-0.343406,46.448831
2019-1203143,2019-09-10,000001,Vente,8500,,,LA GALINIERE,B016,79220,79241,Saint-Christophe-sur-Roc,79,,,792410000C0351,,,,,,,,,,,,,0,,,,,T,terres,,,860,-0.343647,46.448775
2019-1203143,2019-09-10,000001,Vente,8500,,,LE GROS BUISSON,B020,79220,79241,Saint-Christophe-sur-Roc,79,,,792410000C0418,,,,,,,,,,,,,0,,,,,P,prés,,,1050,-0.342705,46.446857
2019-1203143,2019-09-10,000001,Vente,8500,,,LE GROS BUISSON,B020,79220,79241,Saint-Christophe-sur-Roc,79,,,792410000C0419,,,,,,,,,,,,,0,,,,,P,prés,,,1155,-0.342944,46.446894
2019-1203143,2019-09-10,000001,Vente,8500,,,LE GROS BUISSON,B020,79220,79241,Saint-Christophe-sur-Roc,79,,,792410000C0420,,,,,,,,,,,,,0,,,,,P,prés,,,3360,-0.343205,46.446738
2019-1203143,2019-09-10,000001,Vente,8500,,,LE GROS BUISSON,B020,79220,79241,Saint-Christophe-sur-Roc,79,,,792410000C0421,,,,,,,,,,,,,0,,,,,P,prés,,,1200,-0.343368,46.446601
2019-1203143,2019-09-10,000001,Vente,8500,,,LE GROS BUISSON,B020,79220,79241,Saint-Christophe-sur-Roc,79,,,792410000C0424,,,,,,,,,,,,,0,,,,,BT,taillis simples,,,280,-0.343278,46.446211
2019-1203143,2019-09-10,000001,Vente,8500,,,LE GROS BUISSON,B020,79220,79241,Saint-Christophe-sur-Roc,79,,,792410000C0425,,,,,,,,,,,,,0,,,,,P,prés,,,550,-0.343729,46.446538
2019-1203143,2019-09-10,000001,Vente,8500,,,LE GROS BUISSON,B020,79220,79241,Saint-Christophe-sur-Roc,79,,,792410000C0426,,,,,,,,,,,,,0,,,,,P,prés,,,1140,-0.343687,46.446329
2019-1203143,2019-09-10,000001,Vente,8500,,,LE GROS BUISSON,B020,79220,79241,Saint-Christophe-sur-Roc,79,,,792410000C0427,,,,,,,,,,,,,0,,,,,P,prés,,,1360,-0.343847,46.446279
2019-1203143,2019-09-10,000001,Vente,8500,,,LE GROS BUISSON,B020,79220,79241,Saint-Christophe-sur-Roc,79,,,792410000C0429,,,,,,,,,,,,,0,,,,,P,prés,,,5270,-0.344208,46.445772
2019-1203143,2019-09-10,000001,Vente,8500,,,GUIGNEBUS ET LES CORDES,B021,79220,79241,Saint-Christophe-sur-Roc,79,,,792410000C0480,,,,,,,,,,,,,0,,,,,T,terres,,,4570,-0.341681,46.443556
2019-1203143,2019-09-10,000001,Vente,8500,,,GUIGNEBUS ET LES CORDES,B021,79220,79241,Saint-Christophe-sur-Roc,79,,,792410000C0482,,,,,,,,,,,,,0,,,,,T,terres,,,6340,-0.342093,46.444294
2019-1203143,2019-09-10,000001,Vente,8500,,,LE GROS BUISSON,B020,79220,79241,Saint-Christophe-sur-Roc,79,,,792410000C0710,,,,,,,,,,,,,0,,,,,P,prés,,,1110,-0.343483,46.446466
2019-1203144,2019-09-10,000002,Vente,2500,,,LA GALINIERE,B016,79220,79241,Saint-Christophe-sur-Roc,79,,,79241000AC0068,,,,,,,,,,,,,0,,,,,T,terres,,,446,-0.344069,46.448635
2019-1203144,2019-09-10,000002,Vente,2500,,,LA GALINIERE,B016,79220,79241,Saint-Christophe-sur-Roc,79,,,79241000AC0070,,,,,,,,,,,,,0,,,,,VI,vignes,,,2205,-0.343892,46.448783
2019-1203144,2019-09-10,000002,Vente,2500,,,LES COMBES,B012,79220,79241,Saint-Christophe-sur-Roc,79,,,792410000C0335,,,,,,,,,,,,,0,,,,,P,prés,,,3500,-0.344413,46.446957
2019-1203144,2019-09-10,000002,Vente,2500,,,LE GROS BUISSON,B020,79220,79241,Saint-Christophe-sur-Roc,79,,,792410000C0416,,,,,,,,,,,,,0,,,,,P,prés,,,4040,-0.34238,46.447224
2019-1203144,2019-09-10,000002,Vente,2500,,,LE GROS BUISSON,B020,79220,79241,Saint-Christophe-sur-Roc,79,,,792410000C0417,,,,,,,,,,,,,0,,,,,P,prés,,,2325,-0.342551,46.447016
2019-1203469,2019-09-12,000001,Vente,155000,,,LE BREUIL,B005,79220,79241,Saint-Christophe-sur-Roc,79,,,792410000B0240,,,,,,,,,,,,,0,,,,,P,prés,,,180,-0.366165,46.450275
2019-1203469,2019-09-12,000001,Vente,155000,7,,IMP DE LA BURGALIERE LE BREUIL,0020,79220,79241,Saint-Christophe-sur-Roc,79,,,792410000B0672,,,,,,,,,,,,,0,1,Maison,140,4,S,sols,,,123,-0.366286,46.450257
2019-1203469,2019-09-12,000001,Vente,155000,,,LE BREUIL,B005,79220,79241,Saint-Christophe-sur-Roc,79,,,792410000B0731,,,,,,,,,,,,,0,,,,,S,sols,,,132,-0.366238,46.450304
2019-1203469,2019-09-12,000001,Vente,155000,,,LE BREUIL,B005,79220,79241,Saint-Christophe-sur-Roc,79,,,792410000B0731,,,,,,,,,,,,,0,,,,,J,jardins,,,623,-0.366238,46.450304
2019-1203469,2019-09-12,000001,Vente,155000,,,LE BREUIL,B005,79220,79241,Saint-Christophe-sur-Roc,79,,,792410000B0784,,,,,,,,,,,,,0,,,,,S,sols,,,27,-0.366531,46.450217
2019-1203469,2019-09-12,000001,Vente,155000,,,LE BREUIL,B005,79220,79241,Saint-Christophe-sur-Roc,79,,,792410000B0801,,,,,,,,,,,,,0,,,,,P,prés,,,142,-0.366694,46.450472
2019-1203469,2019-09-12,000001,Vente,155000,,,LE BREUIL,B005,79220,79241,Saint-Christophe-sur-Roc,79,,,792410000B0804,,,,,,,,,,,,,0,,,,,T,terres,,,439,-0.366561,46.450508
2019-1203469,2019-09-12,000001,Vente,155000,,,LE BREUIL,B005,79220,79241,Saint-Christophe-sur-Roc,79,,,792410000B0806,,,,,,,,,,,,,0,,,,,T,terres,,,594,-0.366209,46.45039
2019-1203880,2019-10-08,000001,Vente,245000,,,LALEU,B023,79220,79241,Saint-Christophe-sur-Roc,79,,,792410000A0739,,,,,,,,,,,,,0,,,,,J,jardins,,,1167,-0.366527,46.45314
2019-1203880,2019-10-08,000001,Vente,245000,18,,RUE DU BREUIL LE BREUIL,0010,79220,79241,Saint-Christophe-sur-Roc,79,,,792410000A0812,,,,,,,,,,,,,0,1,Maison,240,7,S,sols,,,1684,-0.366333,46.453064
2019-1203880,2019-10-08,000001,Vente,245000,,,LALEU,B023,79220,79241,Saint-Christophe-sur-Roc,79,,,792410000A0815,,,,,,,,,,,,,0,,,,,S,sols,,,162,-0.36617,46.452858
