id_mutation,date_mutation,numero_disposition,nature_mutation,valeur_fonciere,adresse_numero,adresse_suffixe,adresse_nom_voie,adresse_code_voie,code_postal,code_commune,nom_commune,code_departement,ancien_code_commune,ancien_nom_commune,id_parcelle,ancien_id_parcelle,numero_volume,lot1_numero,lot1_surface_carrez,lot2_numero,lot2_surface_carrez,lot3_numero,lot3_surface_carrez,lot4_numero,lot4_surface_carrez,lot5_numero,lot5_surface_carrez,nombre_lots,code_type_local,type_local,surface_reelle_bati,nombre_pieces_principales,code_nature_culture,nature_culture,code_nature_culture_speciale,nature_culture_speciale,surface_terrain,longitude,latitude
2019-1214222,2019-01-28,000001,Vente,35000,,,CUMONVILLE,B016,80150,80396,Gueschart,80,,,80396000AM0018,,,,,,,,,,,,,0,,,,,J,jardins,,,880,2.04111,50.239345
2019-1214222,2019-01-28,000001,Vente,35000,,,CUMONVILLE,B016,80150,80396,Gueschart,80,,,80396000AM0019,,,,,,,,,,,,,0,,,,,P,prés,,,2296,2.040568,50.239236
2019-1214222,2019-01-28,000001,Vente,35000,8,,RUE DE CUMONVILLE,0125,80150,80396,Gueschart,80,,,80396000AM0047,,,,,,,,,,,,,0,1,Maison,125,2,S,sols,,,1347,2.04077,50.239439
2019-1214222,2019-01-28,000001,Vente,35000,8,,RUE DE CUMONVILLE,0125,80150,80396,Gueschart,80,,,80396000AM0048,,,,,,,,,,,,,0,,,,,S,sols,,,94,2.040492,50.239134
2019-1214424,2019-02-08,000001,Vente,130000,7,B,RUE DU GENERAL LECLERC,0140,80150,80396,Gueschart,80,,,80396000AL0155,,,,,,,,,,,,,0,1,Maison,96,3,S,sols,,,500,2.009578,50.239969
2019-1214424,2019-02-08,000001,Vente,130000,7,B,RUE DU GENERAL LECLERC,0140,80150,80396,Gueschart,80,,,80396000AL0155,,,,,,,,,,,,,0,1,Maison,96,3,J,jardins,,,983,2.009578,50.239969
2019-1214485,2019-02-15,000002,Vente,12600,,,RUE DE BOURRE,0100,80150,80396,Gueschart,80,,,80396000AD0106,,,,,,,,,,,,,0,,,,,S,sols,,,3,2.019628,50.237656
2019-1214485,2019-02-15,000002,Vente,12600,,,LE VILLAGE,B038,80150,80396,Gueschart,80,,,80396000AD0161,,,,,,,,,,,,,0,,,,,P,prés,,,697,2.019524,50.237694
2019-1215163,2019-04-19,000001,Vente,125000,,,LE VILLAGE,B038,80150,80396,Gueschart,80,,,80396000AD0029,,,,,,,,,,,,,0,,,,,J,jardins,,,1802,2.014069,50.239681
2019-1215163,2019-04-19,000001,Vente,125000,,,LE VILLAGE,B038,80150,80396,Gueschart,80,,,80396000AD0029,,,,,,,,,,,,,0,,,,,S,sols,,,21,2.014069,50.239681
2019-1215163,2019-04-19,000001,Vente,125000,10,,RUE DE GOVE,0160,80150,80396,Gueschart,80,,,80396000AD0030,,,,,,,,,,,,,0,1,Maison,113,5,S,sols,,,701,2.013431,50.239834
2019-1215414,2019-05-28,000001,Vente,12316.2,,,LES TRENTE,B035,80150,80396,Gueschart,80,,,80396000ZC0003,,,,,,,,,,,,,0,,,,,T,terres,,,8625,2.048719,50.240613
2019-1215653,2019-06-26,000001,Vente,43231.5,,,A LA VOIE DE NEUILLY,B041,80150,80396,Gueschart,80,,,80396000ZD0059,,,,,,,,,,,,,0,,,,,T,terres,,,28821,2.0195,50.230057
2019-1217297,2019-11-09,000001,Vente,70000,21,,RUE DU BAS,0040,80150,80396,Gueschart,80,,,80396000AK0019,,,,,,,,,,,,,0,1,Maison,39,3,S,sols,,,559,2.004079,50.239822
2019-1217586,2019-12-19,000001,Vente,129000,,,LE VILLAGE,B038,80150,80396,Gueschart,80,,,80396000AI0057,,,,,,,,,,,,,0,,,,,P,prés,,,1818,2.010413,50.238815
2019-1217586,2019-12-19,000001,Vente,129000,,,LE VILLAGE,B038,80150,80396,Gueschart,80,,,80396000AI0057,,,,,,,,,,,,,0,,,,,S,sols,,,49,2.010413,50.238815
2019-1217586,2019-12-19,000001,Vente,129000,1,,RUE DU GENERAL LECLERC,0140,80150,80396,Gueschart,80,,,80396000AI0121,,,,,,,,,,,,,0,1,Maison,87,4,S,sols,,,1039,2.010627,50.23886
2019-1217586,2019-12-19,000001,Vente,129000,1,,RUE DU GENERAL LECLERC,0140,80150,80396,Gueschart,80,,,80396000AI0122,,,,,,,,,,,,,0,,,,,S,sols,,,46,2.010378,50.238949
2019-1217616,2019-12-23,000001,Vente,52000,,,LE VILLAGE,B038,80150,80396,Gueschart,80,,,80396000AC0036,,,,,,,,,,,,,0,,,,,J,jardins,,,463,2.013184,50.244943
2019-1217616,2019-12-23,000001,Vente,52000,2,,RUE DU BOIS,0060,80150,80396,Gueschart,80,,,80396000AC0037,,,,,,,,,,,,,0,1,Maison,105,5,S,sols,,,438,2.013104,50.24486
2019-1217616,2019-12-23,000001,Vente,52000,5029,A,RUE DU BOIS,0060,80150,80396,Gueschart,80,,,80396000AC0170,,,,,,,,,,,,,0,3,Dépendance,,0,S,sols,,,46,2.013144,50.244716
