id_mutation,date_mutation,numero_disposition,nature_mutation,valeur_fonciere,adresse_numero,adresse_suffixe,adresse_nom_voie,adresse_code_voie,code_postal,code_commune,nom_commune,code_departement,ancien_code_commune,ancien_nom_commune,id_parcelle,ancien_id_parcelle,numero_volume,lot1_numero,lot1_surface_carrez,lot2_numero,lot2_surface_carrez,lot3_numero,lot3_surface_carrez,lot4_numero,lot4_surface_carrez,lot5_numero,lot5_surface_carrez,nombre_lots,code_type_local,type_local,surface_reelle_bati,nombre_pieces_principales,code_nature_culture,nature_culture,code_nature_culture_speciale,nature_culture_speciale,surface_terrain,longitude,latitude
2019-1214296,2019-02-05,000001,Vente,10000,,,LE VILLAGE NORD,B042,80600,80544,Mézerolles,80,,,80544000AC0194,,,,,,,,,,,,,0,,,,,S,sols,,,377,2.237813,50.189363
2019-1214296,2019-02-05,000001,Vente,10000,,,LE VILLAGE,B041,80600,80544,Mézerolles,80,,,80544000AC0197,,,,,,,,,,,,,0,,,,,P,prés,,,532,2.238049,50.189259
2019-1214828,2019-03-28,000001,Vente,76928,,,LES GRANDS CHAMPS,B024,80600,80544,Mézerolles,80,,,80544000ZD0013,,,,,,,,,,,,,0,,,,,T,terres,,,5940,2.201081,50.183546
2019-1214828,2019-03-28,000001,Vente,76928,,,LES GRANDS CHAMPS,B024,80600,80544,Mézerolles,80,,,80544000ZD0014,,,,,,,,,,,,,0,,,,,T,terres,,,7710,2.200747,50.183361
2019-1214828,2019-03-28,000001,Vente,76928,,,LES GRANDS CHAMPS,B024,80600,80544,Mézerolles,80,,,80544000ZD0015,,,,,,,,,,,,,0,,,,,T,terres,,,7680,2.200905,50.183028
2019-1215143,2019-04-26,000001,Vente,114350,46,,GR GRANDE RUE,0020,80600,80544,Mézerolles,80,,,80544000AB0015,,,,,,,,,,,,,0,1,Maison,100,4,S,sols,,,644,2.232368,50.186878
2019-1215274,2019-05-17,000001,Vente,6000,,,LE FOND DE COURCELLE,B016,80600,80544,Mézerolles,80,,,805440000A0137,,,,,,,,,,,,,0,,,,,T,terres,,,9380,2.242754,50.182643
2019-1215451,2019-06-04,000001,Vente,109750,,,LE VILLAGE,B041,80600,80544,Mézerolles,80,,,80544000AB0075,,,,,,,,,,,,,0,,,,,P,prés,,,1708,2.233854,50.187441
2019-1215451,2019-06-04,000001,Vente,109750,30,,GR GRANDE RUE,0020,80600,80544,Mézerolles,80,,,80544000AB0077,,,,,,,,,,,,,0,1,Maison,167,4,S,sols,,,1060,2.234171,50.186944
2019-1215560,2019-06-14,000001,Vente,70000,8,,RUE SAINT PIERRE,0060,80600,80544,Mézerolles,80,,,80544000AB0063,,,,,,,,,,,,,0,1,Maison,65,3,S,sols,,,280,2.228537,50.186137
2019-1215560,2019-06-14,000001,Vente,70000,,,LE VILLAGE,B041,80600,80544,Mézerolles,80,,,80544000AB0064,,,,,,,,,,,,,0,,,,,J,jardins,,,939,2.228487,50.186252
2019-1215560,2019-06-14,000001,Vente,70000,,,LE FOSSE FERON,B018,80600,80544,Mézerolles,80,,,805440000C0126,,,,,,,,,,,,,0,,,,,T,terres,,,142,2.228112,50.186283
2019-1215664,2019-06-25,000001,Vente,3306.75,,,LA POUILLETTE,B029,80600,80544,Mézerolles,80,,,80544000ZH0029,,,,,,,,,,,,,0,,,,,T,terres,,,2205,2.231667,50.196161
2019-1215664,2019-06-25,000001,Vente,3306.75,,,LA POUILLETTE,B029,80600,80544,Mézerolles,80,,,80544000ZH0029,,,,,,,,,,,,,0,,,,,T,terres,,,2204,2.231667,50.196161
2019-1217047,2019-10-16,000001,Vente,155000,45,,GR GRANDE RUE,0020,80600,80544,Mézerolles,80,,,80544000AB0040,,,,,,,,,,,,,0,1,Maison,88,4,AG,terrains d'agrément,,,1790,2.231616,50.186207
2019-1217047,2019-10-16,000001,Vente,155000,45,,GR GRANDE RUE,0020,80600,80544,Mézerolles,80,,,80544000AB0040,,,,,,,,,,,,,0,1,Maison,88,4,S,sols,,,1300,2.231616,50.186207
2019-1217620,2019-12-13,000001,Vente,130000,20,,GR GRANDE RUE,0020,80600,80544,Mézerolles,80,,,80544000AC0129,,,,,,,,,,,,,0,1,Maison,98,4,S,sols,,,959,2.236013,50.187706
