id_mutation,date_mutation,numero_disposition,nature_mutation,valeur_fonciere,adresse_numero,adresse_suffixe,adresse_nom_voie,adresse_code_voie,code_postal,code_commune,nom_commune,code_departement,ancien_code_commune,ancien_nom_commune,id_parcelle,ancien_id_parcelle,numero_volume,lot1_numero,lot1_surface_carrez,lot2_numero,lot2_surface_carrez,lot3_numero,lot3_surface_carrez,lot4_numero,lot4_surface_carrez,lot5_numero,lot5_surface_carrez,nombre_lots,code_type_local,type_local,surface_reelle_bati,nombre_pieces_principales,code_nature_culture,nature_culture,code_nature_culture_speciale,nature_culture_speciale,surface_terrain,longitude,latitude
2019-1214359,2019-01-19,000001,Vente,8963.25,,,AU CHEMIN DE LA VIOLETTE,B007,80120,80713,Saint-Quentin-en-Tourmont,80,,,807130000A0117,,,,,,,,,,,,,0,,,,,T,terres,,,8830,1.596988,50.288516
2019-1214359,2019-01-19,000001,Vente,8963.25,,,AU CHEMIN DE LA VIOLETTE,B007,80120,80713,Saint-Quentin-en-Tourmont,80,,,807130000A0117,,,,,,,,,,,,,0,,,,,T,terres,,,8830,1.596988,50.288516
2019-1214359,2019-01-19,000001,Vente,8963.25,,,AU CHEMIN DE LA VIOLETTE,B007,80120,80713,Saint-Quentin-en-Tourmont,80,,,807130000A0120,,,,,,,,,,,,,0,,,,,T,terres,,,3430,1.596449,50.289721
2019-1214520,2019-02-02,000001,Vente,190000,,,LE VILLAGE,B029,80120,80713,Saint-Quentin-en-Tourmont,80,,,807130000B0196,,,,,,,,,,,,,0,,,,,P,prés,,,4473,1.588639,50.28008
2019-1214520,2019-02-02,000001,Vente,190000,11,,RUE DES ECOLES,0008,80120,80713,Saint-Quentin-en-Tourmont,80,,,807130000B0462,,,,,,,,,,,,,0,1,Maison,65,4,S,sols,,,684,1.588773,50.280584
2019-1214520,2019-02-02,000001,Vente,190000,,,LE VILLAGE,B029,80120,80713,Saint-Quentin-en-Tourmont,80,,,807130000B0463,,,,,,,,,,,,,0,,,,,S,sols,,,1,1.589002,50.280483
2019-1214688,2019-02-20,000001,Vente,40000,,,LE VILLAGE,B029,80120,80713,Saint-Quentin-en-Tourmont,80,,,807130000B0555,,,,,,,,,,,,,0,,,,,AB,terrains a bâtir,,,1000,1.596812,50.283422
2019-1214820,2019-03-13,000001,Vente,71500,,,LE CAMP QUESNOY,B003,80120,80713,Saint-Quentin-en-Tourmont,80,,,807130000B0563,,,,,,,,,,,,,0,,,,,AB,terrains a bâtir,,,800,1.600732,50.271537
2019-1215365,2019-05-04,000001,Vente,85000,14,,LE CHAMP NEUF,B005,80120,80713,Saint-Quentin-en-Tourmont,80,,,807130000D0188,,,,,,,,,,,,,0,1,Maison,71,2,S,sols,,,700,1.604336,50.269416
2019-1215511,2019-05-28,000002,Vente,17160,9004,,LA HAIE PENEE,B015,80120,80713,Saint-Quentin-en-Tourmont,80,,,807130000D0493,,,,,,,,,,,,,0,4,Local industriel. commercial ou assimilé,59394,0,,,,,,1.619567,50.273998
2019-1215511,2019-05-28,000002,Vente,17160,9004,,LA HAIE PENEE,B015,80120,80713,Saint-Quentin-en-Tourmont,80,,,807130000D0493,,,,,,,,,,,,,0,4,Local industriel. commercial ou assimilé,159,0,,,,,,1.619567,50.273998
2019-1215571,2019-05-25,000001,Vente,104000,64,,CHE DES GARENNES,0020,80120,80713,Saint-Quentin-en-Tourmont,80,,,807130000B0448,,,,,,,,,,,,,0,1,Maison,50,4,S,sols,,,894,1.584686,50.281967
2019-1215671,2019-06-28,000001,Vente,70000,5100,,LE VILLAGE,B029,80120,80713,Saint-Quentin-en-Tourmont,80,,,807130000D0273,,,,,,,,,,,,,0,3,Dépendance,,0,E,eaux,ETANG,Etangs,8407,1.611246,50.275862
2019-1216948,2019-10-22,000001,Vente,55000,,,LE VILLAGE,B029,80120,80713,Saint-Quentin-en-Tourmont,80,,,807130000B0449,,,,,,,,,,,,,0,,,,,AB,terrains a bâtir,,,743,1.584209,50.281892
2019-1216951,2019-10-25,000001,Vente,115000,5,,CHE DES GARENNES,0020,80120,80713,Saint-Quentin-en-Tourmont,80,,,807130000C0221,,,,,,,,,,,,,0,1,Maison,72,4,S,sols,,,149,1.597428,50.269593
2019-1216951,2019-10-25,000001,Vente,115000,5,,CHE DES GARENNES,0020,80120,80713,Saint-Quentin-en-Tourmont,80,,,807130000C0221,,,,,,,,,,,,,0,1,Maison,72,4,L,landes,,,873,1.597428,50.269593
2019-1216951,2019-10-25,000001,Vente,115000,5,,CHE DES GARENNES,0020,80120,80713,Saint-Quentin-en-Tourmont,80,,,807130000C0221,,,,,,,,,,,,,0,1,Maison,72,4,P,prés,,,396,1.597428,50.269593
2019-1217622,2019-12-13,000001,Vente,230000,31,,RTE DE FOREST MONTIERS,0010,80120,80713,Saint-Quentin-en-Tourmont,80,,,807130000D0088,,,,,,,,,,,,,0,1,Maison,90,6,S,sols,,,325,1.605136,50.270476
2019-1217622,2019-12-13,000001,Vente,230000,,,TERRES A BECASSINES,B025,80120,80713,Saint-Quentin-en-Tourmont,80,,,807130000D0271,,,,,,,,,,,,,0,,,,,J,jardins,,,394,1.604914,50.270488
2019-1217622,2019-12-13,000001,Vente,230000,,,TERRES A BECASSINES,B025,80120,80713,Saint-Quentin-en-Tourmont,80,,,807130000D0274,,,,,,,,,,,,,0,,,,,S,sols,,,200,1.605298,50.270494
2019-1217622,2019-12-13,000001,Vente,230000,,,TERRES A BECASSINES,B025,80120,80713,Saint-Quentin-en-Tourmont,80,,,807130000D0295,,,,,,,,,,,,,0,,,,,P,prés,,,717,1.605424,50.270529
2019-1217783,2019-12-17,000001,Vente,213500,5,,RUE DU MOULIN,0032,80120,80713,Saint-Quentin-en-Tourmont,80,,,807130000B0066,,,,,,,,,,,,,0,1,Maison,107,4,S,sols,,,729,1.592588,50.284881
2019-1217783,2019-12-17,000001,Vente,213500,,,LE VILLAGE,B029,80120,80713,Saint-Quentin-en-Tourmont,80,,,807130000B0067,,,,,,,,,,,,,0,,,,,J,jardins,,,632,1.592615,50.284794
2019-1217783,2019-12-17,000001,Vente,213500,,,LE VILLAGE,B029,80120,80713,Saint-Quentin-en-Tourmont,80,,,807130000B0067,,,,,,,,,,,,,0,,,,,S,sols,,,14,1.592615,50.284794
2019-1217783,2019-12-17,000001,Vente,213500,,,LE VILLAGE,B029,80120,80713,Saint-Quentin-en-Tourmont,80,,,807130000B0385,,,,,,,,,,,,,0,,,,,P,prés,,,5715,1.592124,50.284044
2019-1217783,2019-12-17,000001,Vente,213500,,,LE VILLAGE,B029,80120,80713,Saint-Quentin-en-Tourmont,80,,,807130000B0386,,,,,,,,,,,,,0,,,,,P,prés,,,965,1.592363,50.284845
