id_mutation,date_mutation,numero_disposition,nature_mutation,valeur_fonciere,adresse_numero,adresse_suffixe,adresse_nom_voie,adresse_code_voie,code_postal,code_commune,nom_commune,code_departement,ancien_code_commune,ancien_nom_commune,id_parcelle,ancien_id_parcelle,numero_volume,lot1_numero,lot1_surface_carrez,lot2_numero,lot2_surface_carrez,lot3_numero,lot3_surface_carrez,lot4_numero,lot4_surface_carrez,lot5_numero,lot5_surface_carrez,nombre_lots,code_type_local,type_local,surface_reelle_bati,nombre_pieces_principales,code_nature_culture,nature_culture,code_nature_culture_speciale,nature_culture_speciale,surface_terrain,longitude,latitude
2019-1214679,2019-03-06,000002,Vente,26666.66,,,AU PRE COLINOIS,B046,80300,80733,Senlis-le-Sec,80,,,807330000F0363,,,,,,,,,,,,,0,,,,,S,sols,,,17,2.573943,50.027146
2019-1214679,2019-03-06,000002,Vente,26666.66,,,AU PRE COLINOIS,B046,80300,80733,Senlis-le-Sec,80,,,807330000F0611,,,,,,,,,,,,,0,,,,,P,prés,,,540,2.573899,50.027182
2019-1214682,2019-03-06,000001,Vente,53333.33,,,AU PRE COLINOIS,B046,80300,80733,Senlis-le-Sec,80,,,807330000F0609,,,,,,,,,,,,,0,,,,,P,prés,,,569,2.573447,50.027017
2019-1214682,2019-03-06,000001,Vente,53333.33,,,AU PRE COLINOIS,B046,80300,80733,Senlis-le-Sec,80,,,807330000F0610,,,,,,,,,,,,,0,,,,,P,prés,,,590,2.573663,50.027148
2019-1215062,2019-04-05,000001,Vente,125000,339,,RUE DE MONTAIGU,0120,80300,80733,Senlis-le-Sec,80,,,807330000F0081,,,,,,,,,,,,,0,,,,,S,sols,,,242,2.582192,50.023222
2019-1215062,2019-04-05,000001,Vente,125000,339,,RUE DE MONTAIGU,0120,80300,80733,Senlis-le-Sec,80,,,807330000F0081,,,,,,,,,,,,,0,,,,,J,jardins,,,458,2.582192,50.023222
2019-1215062,2019-04-05,000001,Vente,125000,339,,RUE DE MONTAIGU,0120,80300,80733,Senlis-le-Sec,80,,,807330000F0082,,,,,,,,,,,,,0,1,Maison,159,4,S,sols,,,255,2.581844,50.023014
2019-1215687,2019-06-06,000002,Vente,88512,,,AU CHAMP DE LIHONS,B012,80300,80733,Senlis-le-Sec,80,,,807330000F0351,,,,,,,,,,,,,0,,,,,P,prés,,,25080,2.571369,50.024779
2019-1215687,2019-06-06,000002,Vente,88512,,,AU BLANC FIEF,B003,80300,80733,Senlis-le-Sec,80,,,80733000ZE0019,,,,,,,,,,,,,0,,,,,T,terres,,,15260,2.590211,50.023298
2019-1215687,2019-06-06,000002,Vente,88512,,,LE CHAMP DES MOINES,B016,80300,80733,Senlis-le-Sec,80,,,80733000ZH0058,,,,,,,,,,,,,0,,,,,T,terres,,,2944,2.581065,50.014659
2019-1215687,2019-06-06,000002,Vente,88512,,,LE CHAMP DES MOINES,B016,80300,80733,Senlis-le-Sec,80,,,80733000ZH0060,,,,,,,,,,,,,0,,,,,T,terres,,,26647,2.581894,50.014466
2019-1215687,2019-06-06,000002,Vente,88512,,,AU CHAMP DES LIHONS  SUD,B015,80300,80733,Senlis-le-Sec,80,,,80733000ZI0005,,,,,,,,,,,,,0,,,,,T,terres,,,18530,2.570637,50.026852
2019-1215687,2019-06-06,000002,Vente,88512,,,LES RIEZ PALETTE,B049,80300,80733,Senlis-le-Sec,80,,,80733000ZI0068,,,,,,,,,,,,,0,,,,,T,terres,,,25000,2.569254,50.016818
2019-1215717,2019-06-06,000001,Vente,6000,,,LE CHAMP DES MOINES,B016,80300,80733,Senlis-le-Sec,80,,,80733000ZH0061,,,,,,,,,,,,,0,,,,,T,terres,,,6000,2.58121,50.013814
