id_mutation,date_mutation,numero_disposition,nature_mutation,valeur_fonciere,adresse_numero,adresse_suffixe,adresse_nom_voie,adresse_code_voie,code_postal,code_commune,nom_commune,code_departement,ancien_code_commune,ancien_nom_commune,id_parcelle,ancien_id_parcelle,numero_volume,lot1_numero,lot1_surface_carrez,lot2_numero,lot2_surface_carrez,lot3_numero,lot3_surface_carrez,lot4_numero,lot4_surface_carrez,lot5_numero,lot5_surface_carrez,nombre_lots,code_type_local,type_local,surface_reelle_bati,nombre_pieces_principales,code_nature_culture,nature_culture,code_nature_culture_speciale,nature_culture_speciale,surface_terrain,longitude,latitude
2019-1224791,2019-06-21,000002,Vente,135000,,,EN RAUCOU HAUT,B036,81500,81236,Saint-Agnan,81,,,812360000B0490,,,,,,,,,,,,,0,,,,,T,terres,,,20936,1.757625,43.689611
2019-1224791,2019-06-21,000002,Vente,135000,,,EN RAUCOU HAUT,B036,81500,81236,Saint-Agnan,81,,,812360000B0542,,,,,,,,,,,,,0,,,,,T,terres,,,37202,1.75813,43.690375
2019-1225053,2019-01-26,000001,Vente,51000,,,LAS GRAYSSOS,B023,81500,81236,Saint-Agnan,81,,,812360000A0822,,,,,,,,,,,,,0,,,,,AB,terrains a bâtir,,,742,1.734791,43.693786
2019-1225148,2019-01-28,000001,Vente,40000,,,LAS GRAYSSOS,B023,81500,81236,Saint-Agnan,81,,,812360000A0858,,,,,,,,,,,,,0,,,,,AB,terrains a bâtir,,,495,1.734105,43.692939
2019-1225342,2019-02-19,000002,Vente,60000,,,LAS GRAYSSOS,B023,81500,81236,Saint-Agnan,81,,,812360000A0864,,,,,,,,,,,,,0,,,,,AB,terrains a bâtir,,,678,1.735248,43.692348
2019-1225342,2019-02-19,000002,Vente,60000,,,LAS GRAYSSOS,B023,81500,81236,Saint-Agnan,81,,,812360000A0866,,,,,,,,,,,,,0,,,,,AB,terrains a bâtir,,,143,1.73501,43.69225
2019-1225342,2019-02-19,000002,Vente,60000,,,LAS GRAYSSOS,B023,81500,81236,Saint-Agnan,81,,,812360000A0867,,,,,,,,,,,,,0,,,,,AB,terrains a bâtir,,,1972,1.735507,43.692559
2019-1225342,2019-02-19,000002,Vente,60000,,,LAS GRAYSSOS,B023,81500,81236,Saint-Agnan,81,,,812360000A0869,,,,,,,,,,,,,0,,,,,AB,terrains a bâtir,,,37,1.734869,43.692346
2019-1225443,2019-02-28,000001,Vente,57500,,,LAS GRAYSSOS,B023,81500,81236,Saint-Agnan,81,,,812360000A0865,,,,,,,,,,,,,0,,,,,AB,terrains a bâtir,,,992,,
2019-1225443,2019-02-28,000001,Vente,57500,,,LAS GRAYSSOS,B023,81500,81236,Saint-Agnan,81,,,812360000A0866,,,,,,,,,,,,,0,,,,,AB,terrains a bâtir,,,143,1.73501,43.69225
2019-1225443,2019-02-28,000001,Vente,57500,,,LAS GRAYSSOS,B023,81500,81236,Saint-Agnan,81,,,812360000A0868,,,,,,,,,,,,,0,,,,,AB,terrains a bâtir,,,1658,,
2019-1225443,2019-02-28,000001,Vente,57500,,,LAS GRAYSSOS,B023,81500,81236,Saint-Agnan,81,,,812360000A0869,,,,,,,,,,,,,0,,,,,AB,terrains a bâtir,,,37,1.734869,43.692346
2019-1225889,2019-04-15,000001,Vente,135000,5019,,LAS GRAYSSOS,B023,81500,81236,Saint-Agnan,81,,,812360000A0210,,,,,,,,,,,,,0,1,Maison,80,2,S,sols,,,480,1.734807,43.692527
2019-1225889,2019-04-15,000001,Vente,135000,,,LAS GRAYSSOS,B023,81500,81236,Saint-Agnan,81,,,812360000A0448,,,,,,,,,,,,,0,,,,,AG,terrains d'agrément,PARC,Parc,122,1.734957,43.692436
2019-1225980,2019-04-23,000001,Vente,425000,,,PRADELLES,B032,81500,81236,Saint-Agnan,81,,,812360000B0300,,,,,,,,,,,,,0,,,,,T,terres,,,409,1.746506,43.68299
2019-1225980,2019-04-23,000001,Vente,425000,,,PRADELLES,B032,81500,81236,Saint-Agnan,81,,,812360000B0302,,,,,,,,,,,,,0,,,,,T,terres,,,150,1.746899,43.683065
2019-1225980,2019-04-23,000001,Vente,425000,,,PRADELLES,B032,81500,81236,Saint-Agnan,81,,,812360000B0303,,,,,,,,,,,,,0,,,,,T,terres,,,245,1.7468,43.683341
2019-1225980,2019-04-23,000001,Vente,425000,,,PRADELLES,B032,81500,81236,Saint-Agnan,81,,,812360000B0305,,,,,,,,,,,,,0,,,,,T,terres,,,69,1.746832,43.683016
2019-1225980,2019-04-23,000001,Vente,425000,,,PRADELLES,B032,81500,81236,Saint-Agnan,81,,,812360000B0307,,,,,,,,,,,,,0,,,,,T,terres,,,2074,1.746189,43.683394
2019-1225980,2019-04-23,000001,Vente,425000,5047,,PRADELLES,B032,81500,81236,Saint-Agnan,81,,,812360000B0309,,,,,,,,,,,,,0,1,Maison,250,5,S,sols,,,3117,1.746507,43.6832
