id_mutation,date_mutation,numero_disposition,nature_mutation,valeur_fonciere,adresse_numero,adresse_suffixe,adresse_nom_voie,adresse_code_voie,code_postal,code_commune,nom_commune,code_departement,ancien_code_commune,ancien_nom_commune,id_parcelle,ancien_id_parcelle,numero_volume,lot1_numero,lot1_surface_carrez,lot2_numero,lot2_surface_carrez,lot3_numero,lot3_surface_carrez,lot4_numero,lot4_surface_carrez,lot5_numero,lot5_surface_carrez,nombre_lots,code_type_local,type_local,surface_reelle_bati,nombre_pieces_principales,code_nature_culture,nature_culture,code_nature_culture_speciale,nature_culture_speciale,surface_terrain,longitude,latitude
2019-1302743,2019-01-09,000001,Vente,105000,,,LA CROIX ROUGE,B071,85670,85204,Saint-Christophe-du-Ligneron,85,,,85204000YH0218,,,,,,,,,,,,,0,,,,,S,sols,,,120,-1.761733,46.815547
2019-1302743,2019-01-09,000001,Vente,105000,5262,,LA CROIX ROUGE,B071,85670,85204,Saint-Christophe-du-Ligneron,85,,,85204000YH0219,,,,,,,,,,,,,0,1,Maison,96,4,S,sols,,,1589,-1.761486,46.815597
2019-1302743,2019-01-09,000001,Vente,105000,,,LA CAILLETIERE,B043,85670,85204,Saint-Christophe-du-Ligneron,85,,,85204000YH0367,,,,,,,,,,,,,0,,,,,T,terres,,,7128,-1.761424,46.814457
2019-1302743,2019-01-09,000001,Vente,105000,,,LA CAILLETIERE,B043,85670,85204,Saint-Christophe-du-Ligneron,85,,,85204000YH0370,,,,,,,,,,,,,0,,,,,S,sols,,,200,-1.760804,46.815552
2019-1302743,2019-01-09,000001,Vente,105000,,,LA CAILLETIERE,B043,85670,85204,Saint-Christophe-du-Ligneron,85,,,85204000YH0371,,,,,,,,,,,,,0,,,,,T,terres,,,4788,-1.761312,46.815371
2019-1302771,2019-01-14,000001,Vente,55000,14,,RUE DES IRIS,0037,85670,85204,Saint-Christophe-du-Ligneron,85,,,85204000ZC0672,,,,,,,,,,,,,0,,,,,AB,terrains a bâtir,,,699,-1.769347,46.828485
2019-1302987,2019-01-21,000001,Vente,43000,,,LA BROSSE,B041,85670,85204,Saint-Christophe-du-Ligneron,85,,,85204000ZC0796,,,,,,,,,,,,,0,,,,,AB,terrains a bâtir,,,614,-1.769263,46.830124
2019-1303010,2019-01-19,000001,Vente,203700,21,,RUE DES TONNELLES,0091,85670,85204,Saint-Christophe-du-Ligneron,85,,,85204000ZH0289,,,,,,,,,,,,,0,1,Maison,111,4,S,sols,,,620,-1.755657,46.823361
2019-1303031,2019-01-30,000001,Vente,210000,29,,RUE DES MIMOSAS,0054,85670,85204,Saint-Christophe-du-Ligneron,85,,,85204000ZC0480,,,,,,,,,,,,,0,4,Local industriel. commercial ou assimilé,460,0,S,sols,,,1229,-1.771662,46.82463
2019-1303055,2019-01-30,000001,Vente,500,,,LA GIBRETIERE BRULEE,B105,85670,85204,Saint-Christophe-du-Ligneron,85,,,85204000ZI0101,,,,,,,,,,,,,0,,,,,BT,taillis simples,,,629,-1.740548,46.815705
2019-1303067,2019-02-15,000001,Vente,94000,3,,RUE GRIGNION DE MONTFORT,0030,85670,85204,Saint-Christophe-du-Ligneron,85,,,85204000AB0233,,,,,,,,,,,,,0,1,Maison,74,3,S,sols,,,92,-1.762607,46.824141
2019-1303183,2019-02-20,000001,Vente,155000,8,,RUE DES MIMOSAS,0054,85670,85204,Saint-Christophe-du-Ligneron,85,,,85204000ZC0164,,,,,,,,,,,,,0,1,Maison,88,4,S,sols,,,813,-1.768185,46.825153
2019-1303194,2019-02-12,000001,Vente,185434,21,,RUE DES PRAIRIES,0067,85670,85204,Saint-Christophe-du-Ligneron,85,,,85204000ZH0128,,,,,,,,,,,,,0,1,Maison,111,4,T,terres,,,750,-1.755391,46.820906
2019-1303194,2019-02-12,000001,Vente,185434,21,,RUE DES PRAIRIES,0067,85670,85204,Saint-Christophe-du-Ligneron,85,,,85204000ZH0128,,,,,,,,,,,,,0,1,Maison,111,4,S,sols,,,500,-1.755391,46.820906
2019-1303361,2019-03-08,000001,Vente,240000,2,,SQ DES CAMELIAS,0099,85670,85204,Saint-Christophe-du-Ligneron,85,,,85204000ZC0784,,,,,,,,,,,,,0,1,Maison,152,5,S,sols,,,666,-1.771031,46.829534
2019-1303371,2019-02-27,000001,Vente,124000,4,,ALL DU VAL FLEURY,0095,85670,85204,Saint-Christophe-du-Ligneron,85,,,85204000AB0435,,,,,,,,,,,,,0,1,Maison,101,3,S,sols,,,404,-1.762829,46.821361
2019-1303412,2019-03-01,000001,Vente,30340.31,,,LA RENAISSANCE,B305,85670,85204,Saint-Christophe-du-Ligneron,85,,,85204000ZB0058,,,,,,,,,,,,,0,,,,,T,terres,,,9210,-1.764869,46.837004
2019-1303412,2019-03-01,000001,Vente,30340.31,,,LA BORDERIE DES LANDES,B032,85670,85204,Saint-Christophe-du-Ligneron,85,,,85204000ZY0012,,,,,,,,,,,,,0,,,,,T,terres,,,25660,-1.713625,46.798509
2019-1303412,2019-03-01,000001,Vente,30340.31,,,LE MOULIN DE LA FORET,B188,85670,85204,Saint-Christophe-du-Ligneron,85,,,85204000ZY0029,,,,,,,,,,,,,0,,,,,T,terres,,,45720,-1.715281,46.798772
2019-1303412,2019-03-01,000001,Vente,30340.31,,,LES LANDES,B158,85670,85204,Saint-Christophe-du-Ligneron,85,,,85204000ZY0080,,,,,,,,,,,,,0,,,,,T,terres,,,7540,-1.713598,46.797528
2019-1303422,2019-03-04,000001,Vente,16030,,,LA CROIX ROUGE,B071,85670,85204,Saint-Christophe-du-Ligneron,85,,,85204000YH0393,,,,,,,,,,,,,0,,,,,P,prés,,,8015,-1.762488,46.818832
2019-1303576,2019-03-25,000001,Vente,55000,20,,RUE DE L ERMITAGE,0021,85670,85204,Saint-Christophe-du-Ligneron,85,,,85204000AB0164,,,,,,,,,,,,,0,1,Maison,58,4,S,sols,,,347,-1.761077,46.825446
2019-1303747,2019-04-05,000001,Vente,99400,,,LA PETITE TAILLEE,B237,85670,85204,Saint-Christophe-du-Ligneron,85,,,85204000ZM0005,,,,,,,,,,,,,0,,,,,T,terres,,,6144,-1.734337,46.82879
2019-1303747,2019-04-05,000001,Vente,99400,,,LA PETITE TAILLEE,B237,85670,85204,Saint-Christophe-du-Ligneron,85,,,85204000ZM0005,,,,,,,,,,,,,0,,,,,E,eaux,,,7056,-1.734337,46.82879
2019-1303747,2019-04-05,000001,Vente,99400,,,LA PETITE TAILLEE,B237,85670,85204,Saint-Christophe-du-Ligneron,85,,,85204000ZM0056,,,,,,,,,,,,,0,,,,,T,terres,,,169,-1.734491,46.829469
2019-1303747,2019-04-05,000001,Vente,99400,,,LA PETITE TAILLEE,B237,85670,85204,Saint-Christophe-du-Ligneron,85,,,85204000ZM0059,,,,,,,,,,,,,0,,,,,S,sols,,,159,-1.734681,46.829094
2019-1303747,2019-04-05,000001,Vente,99400,,,LA PETITE TAILLEE,B237,85670,85204,Saint-Christophe-du-Ligneron,85,,,85204000ZM0060,,,,,,,,,,,,,0,,,,,J,jardins,,,361,-1.734557,46.829082
2019-1303747,2019-04-05,000001,Vente,99400,,,LA PETITE PIECE,B231,85670,85204,Saint-Christophe-du-Ligneron,85,,,85204000ZM0061,,,,,,,,,,,,,0,,,,,S,sols,,,700,-1.734811,46.828955
2019-1303747,2019-04-05,000001,Vente,99400,5078,,LA PETITE TAILLEE,B237,85670,85204,Saint-Christophe-du-Ligneron,85,,,85204000ZM0062,,,,,,,,,,,,,0,1,Maison,66,2,S,sols,,,200,-1.734865,46.829181
2019-1303764,2019-04-02,000001,Vente,120000,,,BEAUCHENE,B015,85670,85204,Saint-Christophe-du-Ligneron,85,,,85204000ZV0084,,,,,,,,,,,,,0,,,,,T,terres,,,20011,-1.717434,46.821127
2019-1303764,2019-04-02,000001,Vente,120000,5126,,LE GRAND COIN,B115,85670,85204,Saint-Christophe-du-Ligneron,85,,,85204000ZV0092,,,,,,,,,,,,,0,1,Maison,80,4,J,jardins,,,3831,-1.716061,46.82121
2019-1303764,2019-04-02,000001,Vente,120000,5126,,LE GRAND COIN,B115,85670,85204,Saint-Christophe-du-Ligneron,85,,,85204000ZV0092,,,,,,,,,,,,,0,1,Maison,80,4,S,sols,,,1000,-1.716061,46.82121
2019-1303773,2019-04-03,000002,Vente,115000,,,LE BOURG,B038,85670,85204,Saint-Christophe-du-Ligneron,85,,,85204000AB0685,,,,,,,,,,,,,0,,,,,J,jardins,,,35,-1.765207,46.824013
2019-1303773,2019-04-03,000002,Vente,115000,,,LE BOURG,B038,85670,85204,Saint-Christophe-du-Ligneron,85,,,85204000AB0687,,,,,,,,,,,,,0,,,,,S,sols,,,207,-1.765059,46.823946
2019-1303791,2019-04-10,000001,Vente,50000,3,,RUE DE L ERMITAGE,0021,85670,85204,Saint-Christophe-du-Ligneron,85,,,85204000AB0425,,,,,,,,,,,,,0,1,Maison,94,3,S,sols,,,459,-1.762028,46.824706
2019-1303836,2019-03-30,000001,Vente,135000,3,,ALL DU PUITS CHALON,0068,85670,85204,Saint-Christophe-du-Ligneron,85,,,85204000ZC0071,,,,,,,,,,,,,0,1,Maison,65,3,S,sols,,,903,-1.766079,46.825368
2019-1303854,2019-04-11,000001,Vente,130000,5002,,RUE JEAN YOLE,0040,85670,85204,Saint-Christophe-du-Ligneron,85,,,85204000AB0561,,,,,,,,,,,,,0,4,Local industriel. commercial ou assimilé,130,0,S,sols,,,130,-1.76174,46.825685
2019-1304016,2019-04-19,000001,Vente,130000,12,,ALL DU VAL FLEURY,0095,85670,85204,Saint-Christophe-du-Ligneron,85,,,85204000AB0443,,,,,,,,,,,,,0,1,Maison,86,5,S,sols,,,581,-1.761661,46.821907
2019-1304158,2019-05-10,000001,Vente,165000,21,,RUE DES VIGNES,0096,85670,85204,Saint-Christophe-du-Ligneron,85,,,85204000ZH0466,,,,,,,,,,,,,0,1,Maison,88,4,S,sols,,,644,-1.754345,46.824574
2019-1304268,2019-05-15,000001,Vente,175000,,,LES RAISINS,B302,85670,85204,Saint-Christophe-du-Ligneron,85,,,85204000ZI0071,,,,,,,,,,,,,0,,,,,S,sols,,,500,-1.727064,46.814928
2019-1304268,2019-05-15,000001,Vente,175000,,,RUE DE PALLUAU,0060,85670,85204,Saint-Christophe-du-Ligneron,85,,,85204000ZI0121,,,,,,,,,,,,,0,1,Maison,89,4,S,sols,,,387,-1.727211,46.814952
2019-1304268,2019-05-15,000001,Vente,175000,,,LES RAISINS,B302,85670,85204,Saint-Christophe-du-Ligneron,85,,,85204000ZI0137,,,,,,,,,,,,,0,,,,,AG,terrains d'agrément,,,832,-1.727001,46.814576
2019-1304268,2019-05-15,000001,Vente,175000,,,LES RAISINS,B302,85670,85204,Saint-Christophe-du-Ligneron,85,,,85204000ZI0139,,,,,,,,,,,,,0,,,,,AG,terrains d'agrément,,,455,-1.727205,46.814669
2019-1304270,2019-05-23,000001,Vente,140000,33,,RUE GRIGNION DE MONTFORT,0030,85670,85204,Saint-Christophe-du-Ligneron,85,,,85204000AB0036,,,,,,,,,,,,,0,1,Maison,85,4,S,sols,,,560,-1.76662,46.824213
2019-1304396,2019-04-16,000002,Vente,38700,,,L HUBERTIERE,B151,85670,85204,Saint-Christophe-du-Ligneron,85,,,85204000ZT0038,,,,,,,,,,,,,0,,,,,T,terres,,,42990,-1.689708,46.822337
2019-1304411,2019-06-14,000001,Vente,189500,19,,RUE DES TONNELLES,0091,85670,85204,Saint-Christophe-du-Ligneron,85,,,85204000ZH0288,,,,,,,,,,,,,0,1,Maison,118,4,S,sols,,,620,-1.755582,46.8236
2019-1304452,2019-06-11,000001,Vente,50000,,,LA GRANDE VERGNE,B139,85670,85204,Saint-Christophe-du-Ligneron,85,,,85204000YM0161,,1,,,,,,,,,,,0,,,,,,,,,,-1.78454,46.807538
2019-1304452,2019-06-11,000001,Vente,50000,,,LA GRANDE VERGNE,B139,85670,85204,Saint-Christophe-du-Ligneron,85,,,85204000YM0162,,,,,,,,,,,,,0,,,,,S,sols,,,500,-1.784687,46.807573
2019-1304452,2019-06-11,000001,Vente,50000,,,LA GRANDE VERGNE,B139,85670,85204,Saint-Christophe-du-Ligneron,85,,,85204000YM0162,,,,,,,,,,,,,0,,,,,J,jardins,,,656,-1.784687,46.807573
2019-1304453,2019-06-11,000001,Vente,40000,,,LA GRANDE VERGNE,B139,85670,85204,Saint-Christophe-du-Ligneron,85,,,85204000YM0161,,2,,,,,,,,,,,0,,,,,,,,,,-1.78454,46.807538
2019-1304453,2019-06-11,000001,Vente,40000,,,LA GRANDE VERGNE,B139,85670,85204,Saint-Christophe-du-Ligneron,85,,,85204000YM0163,,,,,,,,,,,,,0,,,,,S,sols,,,343,-1.784466,46.807463
2019-1304527,2019-05-29,000001,Vente,168000,6,,RUE DE L EGLISE,0018,85670,85204,Saint-Christophe-du-Ligneron,85,,,85204000AB0183,,,,,,,,,,,,,0,1,Maison,55,2,S,sols,,,315,-1.761914,46.823534
2019-1304527,2019-05-29,000001,Vente,168000,6,,RUE DE L EGLISE,0018,85670,85204,Saint-Christophe-du-Ligneron,85,,,85204000AB0183,,,,,,,,,,,,,0,1,Maison,67,2,S,sols,,,315,-1.761914,46.823534
2019-1304618,2019-06-26,000001,Vente,215100,14,,RUE DE LA MINOTERIE,0057,85670,85204,Saint-Christophe-du-Ligneron,85,,,85204000ZC0302,,,,,,,,,,,,,0,1,Maison,101,4,AG,terrains d'agrément,,,586,-1.765323,46.8268
2019-1304618,2019-06-26,000001,Vente,215100,14,,RUE DE LA MINOTERIE,0057,85670,85204,Saint-Christophe-du-Ligneron,85,,,85204000ZC0302,,,,,,,,,,,,,0,1,Maison,101,4,S,sols,,,500,-1.765323,46.8268
2019-1304712,2019-06-26,000001,Vente,120000,5160,,LE BIGNON,B025,85670,85204,Saint-Christophe-du-Ligneron,85,,,85204000ZH0234,,,,,,,,,,,,,0,1,Maison,57,2,S,sols,,,371,-1.747444,46.820556
2019-1304712,2019-06-26,000001,Vente,120000,,,LE BIGNON,B025,85670,85204,Saint-Christophe-du-Ligneron,85,,,85204000ZL0150,,,,,,,,,,,,,0,,,,,J,jardins,,,97,-1.747269,46.820431
2019-1304712,2019-06-26,000001,Vente,120000,,,LE BIGNON,B025,85670,85204,Saint-Christophe-du-Ligneron,85,,,85204000ZL0152,,,,,,,,,,,,,0,,,,,J,jardins,,,222,-1.747033,46.820277
2019-1304733,2019-06-27,000001,Vente,1,,,LES CROISETTES,B069,85670,85204,Saint-Christophe-du-Ligneron,85,,,85204000ZH0462,,,,,,,,,,,,,0,,,,,AG,terrains d'agrément,,,812,-1.754939,46.821846
2019-1304733,2019-06-27,000001,Vente,1,,,LES CROISETTES,B069,85670,85204,Saint-Christophe-du-Ligneron,85,,,85204000ZH0463,,,,,,,,,,,,,0,,,,,P,prés,,,564,-1.75451,46.821833
2019-1304814,2019-07-03,000001,Vente,140000,5,,RUE DE L EGLISE,0018,85670,85204,Saint-Christophe-du-Ligneron,85,,,85204000AB0184,,,,,,,,,,,,,0,1,Maison,82,4,S,sols,,,128,-1.761762,46.823513
2019-1304814,2019-07-03,000001,Vente,140000,,,LE BOURG,B038,85670,85204,Saint-Christophe-du-Ligneron,85,,,85204000AB0467,,,,,,,,,,,,,0,,,,,S,sols,,,108,-1.76169,46.823486
2019-1304816,2019-07-06,000001,Vente,228000,9,,RUE DES TONNELLES,0091,85670,85204,Saint-Christophe-du-Ligneron,85,,,85204000ZH0283,,,,,,,,,,,,,0,1,Maison,150,7,S,sols,,,785,-1.756582,46.823963
2019-1304820,2019-07-01,000002,Vente,84150,,,LE BOURG,B038,85670,85204,Saint-Christophe-du-Ligneron,85,,,85204000AB0595,,,,,,,,,,,,,0,,,,,S,sols,,,6,-1.762545,46.825482
2019-1304820,2019-07-01,000002,Vente,84150,9,,RUE DE L ERMITAGE,0021,85670,85204,Saint-Christophe-du-Ligneron,85,,,85204000AB0691,,,,,,,,,,,,,0,,,,,AB,terrains a bâtir,,,351,-1.762519,46.825477
2019-1304820,2019-07-01,000002,Vente,84150,9,,RUE DE L ERMITAGE,0021,85670,85204,Saint-Christophe-du-Ligneron,85,,,85204000AB0693,,,,,,,,,,,,,0,,,,,AB,terrains a bâtir,,,604,,
2019-1304820,2019-07-01,000002,Vente,84150,,,LE BOURG,B038,85670,85204,Saint-Christophe-du-Ligneron,85,,,85204000AB0698,,,,,,,,,,,,,0,,,,,S,sols,,,55,-1.76246,46.82525
2019-1304889,2019-07-12,000001,Vente,119000,5107,,LE BOUCHAUD,B033,85670,85204,Saint-Christophe-du-Ligneron,85,,,85204000ZT0067,,,,,,,,,,,,,0,1,Maison,109,4,S,sols,,,1059,-1.701677,46.813466
2019-1304889,2019-07-12,000001,Vente,119000,5107,,LE BOUCHAUD,B033,85670,85204,Saint-Christophe-du-Ligneron,85,,,85204000ZT0067,,,,,,,,,,,,,0,1,Maison,109,4,T,terres,,,2172,-1.701677,46.813466
2019-1304889,2019-07-12,000001,Vente,119000,,,L OUCHE D EN BAS,B206,85670,85204,Saint-Christophe-du-Ligneron,85,,,85204000ZT0068,,,,,,,,,,,,,0,,,,,T,terres,,,5727,-1.700913,46.813446
2019-1304923,2019-07-25,000001,Vente,214000,,,LA TENAILLERE,B329,85670,85204,Saint-Christophe-du-Ligneron,85,,,85204000ZV0087,,,,,,,,,,,,,0,,,,,P,prés,,,2686,-1.704589,46.81541
2019-1304923,2019-07-25,000001,Vente,214000,4000,,LA TENAILLERE,B329,85670,85204,Saint-Christophe-du-Ligneron,85,,,85204000ZV0090,,,,,,,,,,,,,0,1,Maison,91,4,S,sols,,,1014,-1.704588,46.815264
2019-1305075,2019-07-30,000001,Vente,123000,13,,RUE DE LA MAIRIE,0045,85670,85204,Saint-Christophe-du-Ligneron,85,,,85204000AB0446,,,,,,,,,,,,,0,1,Maison,70,3,S,sols,,,515,-1.76171,46.822301
2019-1305124,2019-07-26,000001,Vente,35000,,,LA BROSSE,B041,85670,85204,Saint-Christophe-du-Ligneron,85,,,85204000ZC0776,,,,,,,,,,,,,0,,,,,AB,terrains a bâtir,,,494,-1.771015,46.830169
2019-1305135,2019-08-02,000001,Vente,500,,,LA JOSEPHINE,B156,85670,85204,Saint-Christophe-du-Ligneron,85,,,85204000YN0034,,,,,,,,,,,,,0,,,,,VI,vignes,,,1360,-1.771838,46.817558
2019-1305153,2019-07-29,000001,Vente,136000,,,LE BOURG,B038,85670,85204,Saint-Christophe-du-Ligneron,85,,,85204000AB0284,,,,,,,,,,,,,0,3,Dépendance,,0,S,sols,,,60,-1.76336,46.823055
2019-1305153,2019-07-29,000001,Vente,136000,,,LE BOURG,B038,85670,85204,Saint-Christophe-du-Ligneron,85,,,85204000AB0334,,,,,,,,,,,,,0,,,,,P,prés,,,635,-1.763688,46.823025
2019-1305153,2019-07-29,000001,Vente,136000,13,,RUE DU ROCHER,0081,85670,85204,Saint-Christophe-du-Ligneron,85,,,85204000AB0335,,,,,,,,,,,,,0,1,Maison,88,3,S,sols,,,225,-1.763325,46.823
2019-1305157,2019-07-24,000001,Vente,81490.8,9001,,LA JOSEPHINE,B156,85670,85204,Saint-Christophe-du-Ligneron,85,,,85204000YN0254,,,,,,,,,,,,,0,4,Local industriel. commercial ou assimilé,178,0,S,sols,,,445,-1.767603,46.82008
2019-1305157,2019-07-24,000001,Vente,81490.8,9001,,LA JOSEPHINE,B156,85670,85204,Saint-Christophe-du-Ligneron,85,,,85204000YN0254,,,,,,,,,,,,,0,4,Local industriel. commercial ou assimilé,125,0,S,sols,,,445,-1.767603,46.82008
2019-1305226,2019-08-14,000001,Vente,225160,1,,RTE DE LA GRANDE BROSSE,0031,85670,85204,Saint-Christophe-du-Ligneron,85,,,85204000ZB0154,,,,,,,,,,,,,0,1,Maison,179,8,S,sols,,,2340,,
2019-1305364,2019-08-26,000001,Vente,105000,,,LE BOURG,B038,85670,85204,Saint-Christophe-du-Ligneron,85,,,85204000AB0421,,,,,,,,,,,,,0,,,,,S,sols,,,110,-1.761973,46.826415
2019-1305364,2019-08-26,000001,Vente,105000,23,,RUE DE L ERMITAGE,0021,85670,85204,Saint-Christophe-du-Ligneron,85,,,85204000AB0422,,,,,,,,,,,,,0,1,Maison,47,2,S,sols,,,122,-1.761837,46.826406
2019-1305370,2019-08-29,000001,Vente,150000,5712,,LA NEUVILLE,B196,85670,85204,Saint-Christophe-du-Ligneron,85,,,85204000YO0028,,,,,,,,,,,,,0,1,Maison,111,5,S,sols,,,1000,-1.780558,46.823754
2019-1305378,2019-08-29,000001,Vente,243200,6,,SQ DES MOULINS,0059,85670,85204,Saint-Christophe-du-Ligneron,85,,,85204000ZC0875,,,,,,,,,,,,,0,1,Maison,154,7,S,sols,,,936,-1.76852,46.823982
2019-1305379,2019-08-30,000001,Vente,50000,13,,RUE JEAN YOLE,0040,85670,85204,Saint-Christophe-du-Ligneron,85,,,85204000AB0103,,,,,,,,,,,,,0,1,Maison,57,3,S,sols,,,367,-1.763277,46.825141
2019-1305633,2019-09-13,000001,Vente,135000,5257,,LA CROIX ROUGE,B071,85670,85204,Saint-Christophe-du-Ligneron,85,,,85204000YH0196,,,,,,,,,,,,,0,1,Maison,91,3,S,sols,,,581,-1.762445,46.81689
2019-1305633,2019-09-13,000001,Vente,135000,,,LA CROIX ROUGE,B071,85670,85204,Saint-Christophe-du-Ligneron,85,,,85204000YH0282,,,,,,,,,,,,,0,,,,,S,sols,,,115,-1.762636,46.816988
2019-1305633,2019-09-13,000001,Vente,135000,,,LA CROIX ROUGE,B071,85670,85204,Saint-Christophe-du-Ligneron,85,,,85204000YH0284,,,,,,,,,,,,,0,,,,,S,sols,,,285,-1.762714,46.816888
2019-1305724,2019-09-27,000001,Vente,100,,,MOULIN DES SIX,B191,85670,85204,Saint-Christophe-du-Ligneron,85,,,85204000YK0076,,,,,,,,,,,,,0,,,,,P,prés,,,3030,-1.773947,46.796052
2019-1305724,2019-09-27,000001,Vente,100,,,L ETANG,B082,85670,85204,Saint-Christophe-du-Ligneron,85,,,85204000YK0094,,,,,,,,,,,,,0,,,,,P,prés,,,4633,-1.774249,46.796494
2019-1305724,2019-09-27,000001,Vente,100,,,L ETANG,B082,85670,85204,Saint-Christophe-du-Ligneron,85,,,85204000YK0097,,,,,,,,,,,,,0,,,,,T,terres,,,468,-1.772777,46.796195
2019-1305741,2019-09-25,000001,Vente,300000,9002,,RUE DU STADE,0089,85670,85204,Saint-Christophe-du-Ligneron,85,,,85204000ZC0094,,,,,,,,,,,,,0,1,Maison,252,10,S,sols,,,1310,-1.763539,46.827955
2019-1305741,2019-09-25,000001,Vente,300000,9002,,RUE DU STADE,0089,85670,85204,Saint-Christophe-du-Ligneron,85,,,85204000ZC0094,,,,,,,,,,,,,0,1,Maison,252,10,J,jardins,,,270,-1.763539,46.827955
2019-1305741,2019-09-25,000001,Vente,300000,9002,,RUE DU STADE,0089,85670,85204,Saint-Christophe-du-Ligneron,85,,,85204000ZC0094,,,,,,,,,,,,,0,1,Maison,252,10,AG,terrains d'agrément,,,2920,-1.763539,46.827955
2019-1305901,2019-10-23,000001,Vente,150000,,,LE FOUQUET,B093,85670,85204,Saint-Christophe-du-Ligneron,85,,,85204000YH0022,,,,,,,,,,,,,0,,,,,P,prés,,,16290,-1.759628,46.816918
2019-1305901,2019-10-23,000001,Vente,150000,,,LE FOUQUET,B093,85670,85204,Saint-Christophe-du-Ligneron,85,,,85204000YH0022,,,,,,,,,,,,,0,,,,,T,terres,,,9120,-1.759628,46.816918
2019-1305901,2019-10-23,000001,Vente,150000,,,LE FOUQUET,B093,85670,85204,Saint-Christophe-du-Ligneron,85,,,85204000YH0024,,,,,,,,,,,,,0,,,,,T,terres,,,180,-1.758003,46.816344
2019-1305901,2019-10-23,000001,Vente,150000,,,LA CAILLETIERE,B043,85670,85204,Saint-Christophe-du-Ligneron,85,,,85204000YH0025,,,,,,,,,,,,,0,,,,,T,terres,,,11160,,
2019-1305901,2019-10-23,000001,Vente,150000,,,LA CAILLETIERE,B043,85670,85204,Saint-Christophe-du-Ligneron,85,,,85204000YH0025,,,,,,,,,,,,,0,,,,,P,prés,,,27250,,
2019-1305901,2019-10-23,000001,Vente,150000,,,LA CAILLETIERE,B043,85670,85204,Saint-Christophe-du-Ligneron,85,,,85204000YH0026,,,,,,,,,,,,,0,,,,,P,prés,,,11820,,
2019-1305901,2019-10-23,000001,Vente,150000,,,LA CAILLETIERE,B043,85670,85204,Saint-Christophe-du-Ligneron,85,,,85204000YH0028,,,,,,,,,,,,,0,,,,,T,terres,,,20720,-1.75796,46.815463
2019-1305901,2019-10-23,000001,Vente,150000,,,LA CAILLETIERE,B043,85670,85204,Saint-Christophe-du-Ligneron,85,,,85204000YH0028,,,,,,,,,,,,,0,,,,,P,prés,,,900,-1.75796,46.815463
2019-1305901,2019-10-23,000001,Vente,150000,,,LA CAILLETIERE,B043,85670,85204,Saint-Christophe-du-Ligneron,85,,,85204000YH0029,,,,,,,,,,,,,0,,,,,T,terres,,,10790,-1.759219,46.815051
2019-1305901,2019-10-23,000001,Vente,150000,,,LA CAILLETIERE,B043,85670,85204,Saint-Christophe-du-Ligneron,85,,,85204000YH0220,,,,,,,,,,,,,0,,,,,S,sols,,,380,-1.757804,46.8165
2019-1305901,2019-10-23,000001,Vente,150000,,,LA CAILLETIERE,B043,85670,85204,Saint-Christophe-du-Ligneron,85,,,85204000YH0220,,,,,,,,,,,,,0,,,,,P,prés,,,2549,-1.757804,46.8165
2019-1305901,2019-10-23,000001,Vente,150000,,,LA CAILLETIERE,B043,85670,85204,Saint-Christophe-du-Ligneron,85,,,85204000YH0221,,,,,,,,,,,,,0,,,,,S,sols,,,250,-1.757303,46.816319
2019-1305901,2019-10-23,000001,Vente,150000,5264,,LA CAILLETIERE,B043,85670,85204,Saint-Christophe-du-Ligneron,85,,,85204000YH0222,,,,,,,,,,,,,0,1,Maison,76,4,S,sols,,,685,-1.757227,46.816341
2019-1305901,2019-10-23,000001,Vente,150000,,,LA CAILLETIERE,B043,85670,85204,Saint-Christophe-du-Ligneron,85,,,85204000YH0223,,,,,,,,,,,,,0,,,,,S,sols,,,69,-1.756848,46.816227
2019-1305901,2019-10-23,000001,Vente,150000,,,LA CAILLETIERE,B043,85670,85204,Saint-Christophe-du-Ligneron,85,,,85204000ZH0050,,,,,,,,,,,,,0,,,,,T,terres,,,11382,,
2019-1305901,2019-10-23,000001,Vente,150000,,,LA CAILLETIERE,B043,85670,85204,Saint-Christophe-du-Ligneron,85,,,85204000ZH0050,,,,,,,,,,,,,0,,,,,P,prés,,,38218,,
2019-1305901,2019-10-23,000001,Vente,150000,,,LA CAILLETIERE,B043,85670,85204,Saint-Christophe-du-Ligneron,85,,,85204000ZH0174,,,,,,,,,,,,,0,,,,,P,prés,,,1457,,
2019-1305901,2019-10-23,000001,Vente,150000,,,LA CAILLETIERE,B043,85670,85204,Saint-Christophe-du-Ligneron,85,,,85204000ZH0175,,,,,,,,,,,,,0,,,,,P,prés,,,1461,,
2019-1305913,2019-10-15,000001,Vente,160000,,,LES NOUES PLATES,B203,85670,85204,Saint-Christophe-du-Ligneron,85,,,85204000ZD0144,,,,,,,,,,,,,0,,,,,S,sols,,,80,-1.753319,46.839313
2019-1305948,2019-10-07,000001,Vente,42240,1,C,SQ STE ANNE,0087,85670,85204,Saint-Christophe-du-Ligneron,85,,,85204000ZC0880,,,,,,,,,,,,,0,,,,,AB,terrains a bâtir,,,528,-1.773895,46.826343
2019-1305955,2019-10-03,000001,Vente,90000,6,,RUE DU BUREAU,0008,85670,85204,Saint-Christophe-du-Ligneron,85,,,85204000AB0499,,,,,,,,,,,,,0,1,Maison,80,3,S,sols,,,350,-1.76681,46.823894
2019-1306015,2019-10-28,000001,Vente,186500,7,,RUE DES TONNELLES,0091,85670,85204,Saint-Christophe-du-Ligneron,85,,,85204000ZH0282,,,,,,,,,,,,,0,1,Maison,93,4,S,sols,,,794,-1.756937,46.823822
2019-1306057,2019-10-28,000001,Vente,116000,,,LA DEDERIE,B072,85670,85204,Saint-Christophe-du-Ligneron,85,,,85204000YH0120,,,,,,,,,,,,,0,,,,,S,sols,,,380,-1.752994,46.8088
2019-1306057,2019-10-28,000001,Vente,116000,,,LA DEDERIE,B072,85670,85204,Saint-Christophe-du-Ligneron,85,,,85204000YH0121,,,,,,,,,,,,,0,,,,,S,sols,,,480,-1.752769,46.808773
2019-1306057,2019-10-28,000001,Vente,116000,5225,,LA CANTINIERE,B047,85670,85204,Saint-Christophe-du-Ligneron,85,,,85204000YH0128,,,,,,,,,,,,,0,1,Maison,96,3,S,sols,,,332,-1.752903,46.808767
2019-1306057,2019-10-28,000001,Vente,116000,,,LA CANTINIERE,B047,85670,85204,Saint-Christophe-du-Ligneron,85,,,85204000YH0277,,,,,,,,,,,,,0,,,,,S,sols,,,65,-1.753151,46.808548
2019-1306066,2019-10-31,000001,Vente,160000,35,,RUE DE LA MINOTERIE,0057,85670,85204,Saint-Christophe-du-Ligneron,85,,,85204000ZC0411,,,,,,,,,,,,,0,1,Maison,93,4,S,sols,,,597,-1.765467,46.828765
2019-1306184,2019-10-28,000001,Vente,35000,,,LA BROSSE,B041,85670,85204,Saint-Christophe-du-Ligneron,85,,,85204000ZC0778,,,,,,,,,,,,,0,,,,,AB,terrains a bâtir,,,481,-1.771541,46.830242
2019-1306232,2019-11-05,000001,Vente,140000,3,,ALL DE LA ROSERAIE,0083,85670,85204,Saint-Christophe-du-Ligneron,85,,,85204000ZC0580,,,,,,,,,,,,,0,1,Maison,68,3,S,sols,,,508,-1.763695,46.828342
2019-1306323,2019-11-19,000001,Vente,150000,5,,RUE DE L ERMITAGE,0021,85670,85204,Saint-Christophe-du-Ligneron,85,,,85204000AB0659,,,,,,,,,,,,,0,1,Maison,141,4,S,sols,,,680,-1.761899,46.824818
2019-1306423,2019-11-28,000001,Vente,11000,,,LE PATUREAU,B212,85670,85204,Saint-Christophe-du-Ligneron,85,,,85204000YE0011,,,,,,,,,,,,,0,,,,,BP,peupleraies,,,23820,-1.749501,46.806724