id_mutation,date_mutation,numero_disposition,nature_mutation,valeur_fonciere,adresse_numero,adresse_suffixe,adresse_nom_voie,adresse_code_voie,code_postal,code_commune,nom_commune,code_departement,ancien_code_commune,ancien_nom_commune,id_parcelle,ancien_id_parcelle,numero_volume,lot1_numero,lot1_surface_carrez,lot2_numero,lot2_surface_carrez,lot3_numero,lot3_surface_carrez,lot4_numero,lot4_surface_carrez,lot5_numero,lot5_surface_carrez,nombre_lots,code_type_local,type_local,surface_reelle_bati,nombre_pieces_principales,code_nature_culture,nature_culture,code_nature_culture_speciale,nature_culture_speciale,surface_terrain,longitude,latitude
2019-1282136,2019-01-11,000001,Vente,100,,,RUE DE CHANTONNAY,0080,85110,85282,Sigournais,85,,,85282000AD0781,,,,,,,,,,,,,0,,,,,J,jardins,,,86,-0.985578,46.705952
2019-1282797,2019-02-25,000001,Vente,33500,,,LE REQUERRE,B175,85110,85282,Sigournais,85,,,852820000C1003,,,,,,,,,,,,,0,,,,,J,jardins,,,970,-0.975539,46.703476
2019-1282797,2019-02-25,000001,Vente,33500,,,LE REQUERRE,B175,85110,85282,Sigournais,85,,,852820000C1004,,,,,,,,,,,,,0,,,,,J,jardins,,,797,-0.975129,46.70343
2019-1283163,2019-03-04,000002,Vente,1,3,,IMP DES CHARMILLES,0091,85110,85282,Sigournais,85,,,85282000AD0849,,,,,,,,,,,,,0,,,,,S,sols,,,9,-0.983408,46.708804
2019-1283164,2019-03-04,000003,Vente,55000,,,GR GRAND RUE,0300,85110,85282,Sigournais,85,,,85282000AD0328,,,,,,,,,,,,,0,,,,,S,sols,,,38,-0.983406,46.708953
2019-1283164,2019-03-04,000003,Vente,55000,1,,IMP DES CHARMILLES,0091,85110,85282,Sigournais,85,,,85282000AD0543,,,,,,,,,,,,,0,1,Maison,90,4,S,sols,,,77,-0.983496,46.708813
2019-1283164,2019-03-04,000003,Vente,55000,5426,,LE BOURG,B022,85110,85282,Sigournais,85,,,85282000AD0556,,,,,,,,,,,,,0,3,Dépendance,,0,S,sols,,,841,-0.983241,46.708897
2019-1283378,2019-03-22,000001,Vente,240,,,LES BATARDES,B006,85110,85282,Sigournais,85,,,852820000A0639,,,,,,,,,,,,,0,,,,,VI,vignes,,,780,-1.005921,46.716975
2019-1284847,2019-06-13,000001,Vente,1293,,,LE REQUERRE,B175,85110,85282,Sigournais,85,,,852820000B0705,,,,,,,,,,,,,0,,,,,T,terres,,,8620,-0.97846,46.710083
2019-1285468,2019-06-25,000001,Vente,49540,,,LE BOURG,B022,85110,85282,Sigournais,85,,,85282000AD0018,,,,,,,,,,,,,0,,,,,VI,vignes,,,1248,-0.988547,46.706006
2019-1285468,2019-06-25,000001,Vente,49540,,,RUE DE CHANTONNAY,0080,85110,85282,Sigournais,85,,,85282000AD0020,,,,,,,,,,,,,0,,,,,S,sols,,,7,-0.98865,46.706319
2019-1285468,2019-06-25,000001,Vente,49540,,,RUE DE CHANTONNAY,0080,85110,85282,Sigournais,85,,,85282000AD0020,,,,,,,,,,,,,0,,,,,S,sols,,,7,-0.98865,46.706319
2019-1285468,2019-06-25,000001,Vente,49540,,,LE BOURG,B022,85110,85282,Sigournais,85,,,85282000AD0830,,,,,,,,,,,,,0,,,,,VI,vignes,,,508,-0.988436,46.706158
2019-1285468,2019-06-25,000001,Vente,49540,3,,RUE DE CHANTONNAY,0080,85110,85282,Sigournais,85,,,85282000AD0833,,,,,,,,,,,,,0,,,,,S,sols,,,7,-0.988621,46.706305
2019-1285641,2019-07-05,000001,Vente,182665,5,,RUE DES CLAVELLIERES,0125,85110,85282,Sigournais,85,,,852820000C0861,,,,,,,,,,,,,0,1,Maison,110,4,S,sols,,,860,-0.989199,46.704414
2019-1285743,2019-07-17,000001,Vente,21000,,,LE REQUERRE,B175,85110,85282,Sigournais,85,,,852820000C0085,,,,,,,,,,,,,0,,,,,J,jardins,,,285,-0.977213,46.704835
2019-1285743,2019-07-17,000001,Vente,21000,,,LE REQUERRE,B175,85110,85282,Sigournais,85,,,852820000C0089,,,,,,,,,,,,,0,,,,,J,jardins,,,630,-0.977104,46.704971
2019-1285743,2019-07-17,000001,Vente,21000,,,LE REQUERRE,B175,85110,85282,Sigournais,85,,,852820000C0099,,,,,,,,,,,,,0,,,,,S,sols,,,35,-0.976142,46.704141
2019-1285743,2019-07-17,000001,Vente,21000,,,LE REQUERRE,B175,85110,85282,Sigournais,85,,,852820000C0100,,,,,,,,,,,,,0,,,,,S,sols,,,640,,
2019-1285743,2019-07-17,000001,Vente,21000,2,,RUE DU PHARE,0257,85110,85282,Sigournais,85,,,852820000C0164,,,,,,,,,,,,,0,1,Maison,76,3,S,sols,,,170,-0.976242,46.704022
2019-1286475,2019-07-25,000001,Vente,82000,1,,RUE DE CHASSAIS,0100,85110,85282,Sigournais,85,,,85282000AD0275,,,,,,,,,,,,,0,1,Maison,44,2,S,sols,,,256,-0.984182,46.71139
2019-1286475,2019-07-25,000001,Vente,82000,1,,RUE DE CHASSAIS,0100,85110,85282,Sigournais,85,,,85282000AD0275,,,,,,,,,,,,,0,1,Maison,25,1,S,sols,,,256,-0.984182,46.71139
2019-1286475,2019-07-25,000001,Vente,82000,1,,RUE DE CHASSAIS,0100,85110,85282,Sigournais,85,,,85282000AD0275,,,,,,,,,,,,,0,1,Maison,4,0,S,sols,,,256,-0.984182,46.71139
2019-1286637,2019-08-13,000001,Vente,4690,,,PRES DE LA LANDE,B167,85110,85282,Sigournais,85,,,852820000A0814,,,,,,,,,,,,,0,,,,,P,prés,,,1915,-0.99241,46.710714
2019-1286637,2019-08-13,000001,Vente,4690,,,LE REQUERRE,B175,85110,85282,Sigournais,85,,,852820000B0678,,,,,,,,,,,,,0,,,,,T,terres,,,13675,-0.973199,46.712191
2019-1286637,2019-08-13,000001,Vente,4690,,,LE REQUERRE,B175,85110,85282,Sigournais,85,,,852820000B0682,,,,,,,,,,,,,0,,,,,T,terres,,,1955,-0.976116,46.710891
2019-1286637,2019-08-13,000001,Vente,4690,,,LE CHAMP GOURDAN,B042,85110,85282,Sigournais,85,,,852820000B0712,,,,,,,,,,,,,0,,,,,T,terres,,,7005,-0.977156,46.711669
2019-1286834,2019-09-04,000001,Vente,105500,5,,RUE DE LA JINCHERE,0241,85110,85282,Sigournais,85,,,852820000C0720,,,,,,,,,,,,,0,1,Maison,88,4,J,jardins,,,702,-0.985056,46.703711
2019-1286834,2019-09-04,000001,Vente,105500,5,,RUE DE LA JINCHERE,0241,85110,85282,Sigournais,85,,,852820000C0720,,,,,,,,,,,,,0,1,Maison,88,4,S,sols,,,500,-0.985056,46.703711
2019-1286836,2019-09-03,000001,Vente,53000,,,LE BOURG,B022,85110,85282,Sigournais,85,,,85282000AD0039,,,,,,,,,,,,,0,,,,,J,jardins,,,187,-0.988434,46.706986
2019-1286836,2019-09-03,000001,Vente,53000,,,LE BOURG,B022,85110,85282,Sigournais,85,,,85282000AD0089,,,,,,,,,,,,,0,,,,,J,jardins,,,76,-0.989419,46.707337
2019-1286836,2019-09-03,000001,Vente,53000,,,LE BOURG,B022,85110,85282,Sigournais,85,,,85282000AD0092,,,,,,,,,,,,,0,,,,,J,jardins,,,88,-0.989204,46.707314
2019-1286836,2019-09-03,000001,Vente,53000,5178,,RUE DU DONJON,0143,85110,85282,Sigournais,85,,,85282000AD0565,,,,,,,,,,,,,0,1,Maison,60,2,S,sols,,,243,-0.986559,46.707399
2019-1286846,2019-09-04,000001,Vente,37000,5,,RUE DE LA CROIX VERTE,0140,85110,85282,Sigournais,85,,,85282000AD0152,,,,,,,,,,,,,0,1,Maison,86,3,S,sols,,,118,-0.986277,46.707695
2019-1286848,2019-08-13,000002,Vente,3000,,,LA COUSOTIERE,B077,85110,85282,Sigournais,85,,,852820000A0036,,,,,,,,,,,,,0,,,,,S,sols,,,15,-0.992541,46.731095
2019-1286848,2019-08-13,000002,Vente,3000,,,LA COUSOTIERE,B077,85110,85282,Sigournais,85,,,852820000A1171,,,,,,,,,,,,,0,,,,,S,sols,,,129,-0.992441,46.731009
2019-1287156,2019-09-06,000001,Vente,145000,8,,RUE DE CHAVAGNES,0082,85110,85282,Sigournais,85,,,852820000C0867,,,,,,,,,,,,,0,1,Maison,109,4,P,prés,,,736,-0.981656,46.70434
2019-1287156,2019-09-06,000001,Vente,145000,8,,RUE DE CHAVAGNES,0082,85110,85282,Sigournais,85,,,852820000C0867,,,,,,,,,,,,,0,1,Maison,109,4,AG,terrains d'agrément,,,900,-0.981656,46.70434
2019-1287156,2019-09-06,000001,Vente,145000,8,,RUE DE CHAVAGNES,0082,85110,85282,Sigournais,85,,,852820000C0867,,,,,,,,,,,,,0,1,Maison,109,4,J,jardins,,,528,-0.981656,46.70434
2019-1287156,2019-09-06,000001,Vente,145000,8,,RUE DE CHAVAGNES,0082,85110,85282,Sigournais,85,,,852820000C0867,,,,,,,,,,,,,0,1,Maison,109,4,S,sols,,,650,-0.981656,46.70434
2019-1288289,2019-11-06,000001,Vente,123000,4,,RUE DE LA VIGNE RONDE,0141,85110,85282,Sigournais,85,,,85282000AD0672,,,,,,,,,,,,,0,1,Maison,100,3,S,sols,,,788,-0.981939,46.710496
2019-1288289,2019-11-06,000001,Vente,123000,,,LE BOURG,B022,85110,85282,Sigournais,85,,,85282000AD0825,,,,,,,,,,,,,0,,,,,AG,terrains d'agrément,,,96,-0.98181,46.710374
2019-1288875,2019-12-04,000001,Vente,205000,5332,,LA LANDE,B118,85110,85282,Sigournais,85,,,852820000A0393,,,,,,,,,,,,,0,1,Maison,129,5,T,terres,,,9680,-0.993752,46.716158
2019-1288875,2019-12-04,000001,Vente,205000,5332,,LA LANDE,B118,85110,85282,Sigournais,85,,,852820000A0393,,,,,,,,,,,,,0,1,Maison,129,5,S,sols,,,1200,-0.993752,46.716158
2019-1288875,2019-12-04,000001,Vente,205000,,,LA LANDE DE LA NOUETTE,B119,85110,85282,Sigournais,85,,,852820000A0394,,,,,,,,,,,,,0,,,,,BT,taillis simples,,,170,-0.994504,46.715828
2019-1289386,2019-12-23,000001,Vente terrain à bâtir,22932,,,LE COTELET,B073,85110,85282,Sigournais,85,,,852820000C0964,,,,,,,,,,,,,0,,,,,AB,terrains a bâtir,,,637,-0.982165,46.703745
2019-1289415,2019-12-26,000001,Vente,27000,,,LES JAUNIERES,B115,85110,85282,Sigournais,85,,,852820000E0018,,,,,,,,,,,,,0,,,,,T,terres,,,35160,-1.000923,46.735757
2019-1289415,2019-12-26,000001,Vente,27000,,,LES LONGEAIS,B197,85110,85282,Sigournais,85,,,85282000ZB0013,,,,,,,,,,,,,0,,,,,T,terres,,,4080,-0.987299,46.73362
2019-1289415,2019-12-26,000001,Vente,27000,,,LA BARBIERE,B005,85110,85282,Sigournais,85,,,85282000ZB0055,,,,,,,,,,,,,0,,,,,T,terres,,,7470,-0.999208,46.733028
