id_mutation,date_mutation,numero_disposition,nature_mutation,valeur_fonciere,adresse_numero,adresse_suffixe,adresse_nom_voie,adresse_code_voie,code_postal,code_commune,nom_commune,code_departement,ancien_code_commune,ancien_nom_commune,id_parcelle,ancien_id_parcelle,numero_volume,lot1_numero,lot1_surface_carrez,lot2_numero,lot2_surface_carrez,lot3_numero,lot3_surface_carrez,lot4_numero,lot4_surface_carrez,lot5_numero,lot5_surface_carrez,nombre_lots,code_type_local,type_local,surface_reelle_bati,nombre_pieces_principales,code_nature_culture,nature_culture,code_nature_culture_speciale,nature_culture_speciale,surface_terrain,longitude,latitude
2019-1317252,2019-01-10,000001,Vente,135000,,,LE BOURG,B057,86300,86098,Fleix,86,,,860980000B0750,,,,,,,,,,,,,0,,,,,T,terres,,,29,0.745783,46.554482
2019-1317252,2019-01-10,000001,Vente,135000,2,,RUE DE LA VALLEE DES CHARMES,0090,86300,86098,Fleix,86,,,860980000B0751,,,,,,,,,,,,,0,1,Maison,91,5,S,sols,,,316,0.745816,46.554448
2019-1317252,2019-01-10,000001,Vente,135000,2,,RUE DE LA VALLEE DES CHARMES,0090,86300,86098,Fleix,86,,,860980000B0751,,,,,,,,,,,,,0,1,Maison,91,5,T,terres,,,1263,0.745816,46.554448
2019-1317252,2019-01-10,000001,Vente,135000,,,LE BOURG,B057,86300,86098,Fleix,86,,,860980000B0760,,,,,,,,,,,,,0,,,,,S,sols,,,47,0.745817,46.554504
2019-1317545,2019-04-02,000001,Vente,114960,,,LES MAGNOUX,B027,86300,86098,Fleix,86,,,860980000A0045,,,,,,,,,,,,,0,,,,,T,terres,,,13653,0.747068,46.568098
2019-1317545,2019-04-02,000001,Vente,114960,,,LES MAGNOUX,B027,86300,86098,Fleix,86,,,860980000A0048,,,,,,,,,,,,,0,,,,,T,terres,,,640,0.74807,46.566625
2019-1317545,2019-04-02,000001,Vente,114960,,,LES MAGNOUX,B027,86300,86098,Fleix,86,,,860980000A0049,,,,,,,,,,,,,0,,,,,T,terres,,,4023,0.747367,46.566558
2019-1317545,2019-04-02,000001,Vente,114960,,,LES MAGNOUX,B027,86300,86098,Fleix,86,,,860980000A0050,,,,,,,,,,,,,0,,,,,T,terres,,,17161,0.74718,46.56714
2019-1317545,2019-04-02,000001,Vente,114960,,,L VIEUX ESSARTS D LA MAREU,B055,86300,86098,Fleix,86,,,860980000A0077,,,,,,,,,,,,,0,,,,,T,terres,,,8881,0.739156,46.568804
2019-1317545,2019-04-02,000001,Vente,114960,,,L VIEUX ESSARTS D LA MAREU,B055,86300,86098,Fleix,86,,,860980000A0102,,,,,,,,,,,,,0,,,,,T,terres,,,9128,0.738598,46.570576
2019-1317545,2019-04-02,000001,Vente,114960,,,LES ESSARTS,B017,86300,86098,Fleix,86,,,860980000B0011,,,,,,,,,,,,,0,,,,,T,terres,,,1950,0.737989,46.565043
2019-1317545,2019-04-02,000001,Vente,114960,,,LES ESSARTS,B017,86300,86098,Fleix,86,,,860980000B0017,,,,,,,,,,,,,0,,,,,T,terres,,,4804,0.737823,46.565619
2019-1317545,2019-04-02,000001,Vente,114960,,,LE FOURCHET,B018,86300,86098,Fleix,86,,,860980000B0026,,,,,,,,,,,,,0,,,,,T,terres,,,3210,0.740232,46.565157
2019-1317545,2019-04-02,000001,Vente,114960,,,LE FOURCHET,B018,86300,86098,Fleix,86,,,860980000B0027,,,,,,,,,,,,,0,,,,,T,terres,,,1850,0.740536,46.565524
2019-1317545,2019-04-02,000001,Vente,114960,,,LE FOURCHET,B018,86300,86098,Fleix,86,,,860980000B0028,,,,,,,,,,,,,0,,,,,T,terres,,,9610,0.741091,46.565548
2019-1317545,2019-04-02,000001,Vente,114960,,,LE FOURCHET,B018,86300,86098,Fleix,86,,,860980000B0038,,,,,,,,,,,,,0,,,,,T,terres,,,3162,0.745067,46.564205
2019-1317545,2019-04-02,000001,Vente,114960,,,LA BACHELLERIE,B002,86300,86098,Fleix,86,,,860980000B0049,,,,,,,,,,,,,0,,,,,T,terres,,,18191,,
2019-1317545,2019-04-02,000001,Vente,114960,,,LA BACHELLERIE,B002,86300,86098,Fleix,86,,,860980000B0052,,,,,,,,,,,,,0,,,,,T,terres,,,17692,,
2019-1317545,2019-04-02,000001,Vente,114960,,,LES GRELES,B024,86300,86098,Fleix,86,,,860980000B0059,,,,,,,,,,,,,0,,,,,T,terres,,,13755,0.743559,46.561546
2019-1317545,2019-04-02,000001,Vente,114960,,,LES GRELES,B024,86300,86098,Fleix,86,,,860980000B0085,,,,,,,,,,,,,0,,,,,T,terres,,,5506,0.737909,46.560788
2019-1317545,2019-04-02,000001,Vente,114960,,,LES GRELES,B024,86300,86098,Fleix,86,,,860980000B0104,,,,,,,,,,,,,0,,,,,T,terres,,,19940,0.74083,46.561402
2019-1317545,2019-04-02,000001,Vente,114960,,,LES GRELES,B024,86300,86098,Fleix,86,,,860980000B0105,,,,,,,,,,,,,0,,,,,T,terres,,,8114,0.743174,46.560064
2019-1317545,2019-04-02,000001,Vente,114960,,,LES GRELES,B024,86300,86098,Fleix,86,,,860980000B0114,,,,,,,,,,,,,0,,,,,T,terres,,,648,0.742931,46.559348
2019-1317545,2019-04-02,000001,Vente,114960,,,LES GRELES,B024,86300,86098,Fleix,86,,,860980000B0134,,,,,,,,,,,,,0,,,,,T,terres,,,810,0.740583,46.558626
2019-1317545,2019-04-02,000001,Vente,114960,,,LES GRELES,B024,86300,86098,Fleix,86,,,860980000B0136,,,,,,,,,,,,,0,,,,,T,terres,,,1215,0.740561,46.558538
2019-1317545,2019-04-02,000001,Vente,114960,,,LES GRELES,B024,86300,86098,Fleix,86,,,860980000B0137,,,,,,,,,,,,,0,,,,,T,terres,,,1210,0.7408,46.558345
2019-1317545,2019-04-02,000001,Vente,114960,,,LES ROCHETTES,B048,86300,86098,Fleix,86,,,860980000B0318,,,,,,,,,,,,,0,,,,,T,terres,,,10090,0.752393,46.555043
2019-1317545,2019-04-02,000001,Vente,114960,,,LE BOURG,B057,86300,86098,Fleix,86,,,860980000B0329,,,,,,,,,,,,,0,,,,,T,terres,,,2005,0.749706,46.553333
2019-1317545,2019-04-02,000001,Vente,114960,,,LE BOURG,B057,86300,86098,Fleix,86,,,860980000B0338,,,,,,,,,,,,,0,,,,,T,terres,,,870,0.748788,46.554964
2019-1317545,2019-04-02,000001,Vente,114960,,,LE BOURG,B057,86300,86098,Fleix,86,,,860980000B0409,,,,,,,,,,,,,0,,,,,T,terres,,,2021,0.745345,46.55626
2019-1317545,2019-04-02,000001,Vente,114960,,,CHALACHE,B011,86300,86098,Fleix,86,,,860980000B0431,,,,,,,,,,,,,0,,,,,T,terres,,,7681,,
2019-1317545,2019-04-02,000001,Vente,114960,,,CHALACHE,B011,86300,86098,Fleix,86,,,860980000B0434,,,,,,,,,,,,,0,,,,,J,jardins,,,605,0.748063,46.559803
2019-1317545,2019-04-02,000001,Vente,114960,,,LES GRELES,B024,86300,86098,Fleix,86,,,860980000B0566,,,,,,,,,,,,,0,,,,,T,terres,,,10595,0.740107,46.563343
2019-1317545,2019-04-02,000001,Vente,114960,,,LA BACHELLERIE,B002,86300,86098,Fleix,86,,,860980000B0574,,,,,,,,,,,,,0,,,,,T,terres,,,954,,
2019-1317545,2019-04-02,000001,Vente,114960,,,LE BOURG,B057,86300,86098,Fleix,86,,,860980000B0595,,,,,,,,,,,,,0,,,,,T,terres,,,1235,0.745733,46.556687
2019-1317545,2019-04-02,000001,Vente,114960,,,LA MINIERE,B032,86300,86098,Fleix,86,,,860980000B0724,,,,,,,,,,,,,0,,,,,T,terres,,,14246,0.747155,46.557764
2019-1317692,2019-05-18,000001,Vente,1,,,CHALACHE,B011,86300,86098,Fleix,86,,,860980000B0437,,,,,,,,,,,,,0,,,,,S,sols,,,284,0.748048,46.559612
2019-1317723,2019-05-23,000001,Echange,12000,,,LE BOURG,B057,86300,86098,Fleix,86,,,860980000B0371,,,,,,,,,,,,,0,,,,,S,sols,,,40,0.744308,46.555206
2019-1317723,2019-05-23,000001,Echange,12000,,,LE BOURG,B057,86300,86098,Fleix,86,,,860980000B0372,,,,,,,,,,,,,0,,,,,T,terres,,,1103,0.744383,46.555094
2019-1317723,2019-05-23,000001,Echange,12000,5011,,LE BOURG,B057,86300,86098,Fleix,86,,,860980000B0378,,,,,,,,,,,,,0,1,Maison,62,3,S,sols,,,538,0.744994,46.555176
2019-1317723,2019-05-23,000001,Echange,12000,5010,,LE BOURG,B057,86300,86098,Fleix,86,,,860980000B0381,,,,,,,,,,,,,0,1,Maison,90,4,S,sols,,,102,0.745233,46.555155
2019-1317723,2019-05-23,000001,Echange,12000,,,LE BOURG,B057,86300,86098,Fleix,86,,,860980000B0769,,,,,,,,,,,,,0,,,,,S,sols,,,53,0.744936,46.55527
2019-1317869,2019-07-18,000001,Vente,144000,,,CHALACHE,B011,86300,86098,Fleix,86,,,860980000B0454,,,,,,,,,,,,,0,,,,,P,prés,,,580,0.746695,46.558695
2019-1317869,2019-07-18,000001,Vente,144000,5024,,CHALACHE,B011,86300,86098,Fleix,86,,,860980000B0457,,,,,,,,,,,,,0,1,Maison,135,3,S,sols,,,569,0.746953,46.559001
2019-1317869,2019-07-18,000001,Vente,144000,,,CHALACHE,B011,86300,86098,Fleix,86,,,860980000B0462,,,,,,,,,,,,,0,,,,,S,sols,,,156,0.747094,46.559312
2019-1317869,2019-07-18,000001,Vente,144000,,,CHALACHE,B011,86300,86098,Fleix,86,,,860980000B0627,,,,,,,,,,,,,0,,,,,S,sols,,,74,0.747226,46.55923
2019-1317869,2019-07-18,000001,Vente,144000,,,CHALACHE,B011,86300,86098,Fleix,86,,,860980000B0628,,,,,,,,,,,,,0,,,,,S,sols,,,155,0.747117,46.559213
2019-1317869,2019-07-18,000001,Vente,144000,,,CHALACHE,B011,86300,86098,Fleix,86,,,860980000B0629,,,,,,,,,,,,,0,,,,,S,sols,,,103,0.746941,46.559276
2019-1317869,2019-07-18,000001,Vente,144000,,,CHALACHE,B011,86300,86098,Fleix,86,,,860980000B0630,,,,,,,,,,,,,0,,,,,S,sols,,,55,0.747131,46.559134
2019-1317869,2019-07-18,000001,Vente,144000,,,CHALACHE,B011,86300,86098,Fleix,86,,,860980000B0631,,,,,,,,,,,,,0,,,,,S,sols,,,28,0.747194,46.559094
2019-1317869,2019-07-18,000001,Vente,144000,,,CHALACHE,B011,86300,86098,Fleix,86,,,860980000B0632,,,,,,,,,,,,,0,,,,,S,sols,,,7,0.747222,46.559145
2019-1317869,2019-07-18,000001,Vente,144000,,,CHALACHE,B011,86300,86098,Fleix,86,,,860980000B0633,,,,,,,,,,,,,0,,,,,S,sols,,,320,0.74688,46.559105
2019-1317869,2019-07-18,000001,Vente,144000,,,CHALACHE,B011,86300,86098,Fleix,86,,,860980000B0634,,,,,,,,,,,,,0,,,,,S,sols,,,7,0.746991,46.5592
2019-1317988,2019-08-06,000001,Vente,85000,,,LA ROCHE,B047,86300,86098,Fleix,86,,,860980000B0265,,,,,,,,,,,,,0,,,,,T,terres,,,1516,0.758539,46.551248
2019-1317988,2019-08-06,000001,Vente,85000,,,LA ROCHE,B047,86300,86098,Fleix,86,,,860980000B0266,,,,,,,,,,,,,0,,,,,BT,taillis simples,,,820,0.758381,46.551085
2019-1317988,2019-08-06,000001,Vente,85000,3,,LA ROCHE,B047,86300,86098,Fleix,86,,,860980000B0272,,,,,,,,,,,,,0,1,Maison,112,4,S,sols,,,1206,0.75846,46.55158
2019-1317988,2019-08-06,000001,Vente,85000,,,LA ROCHE,B047,86300,86098,Fleix,86,,,860980000B0273,,,,,,,,,,,,,0,,,,,S,sols,,,76,0.758876,46.551548
2019-1318118,2019-10-03,000001,Vente,100,,,CHALACHE,B011,86300,86098,Fleix,86,,,860980000B0435,,,,,,,,,,,,,0,,,,,S,sols,,,59,0.748126,46.559649
2019-1318118,2019-10-03,000001,Vente,100,,,CHALACHE,B011,86300,86098,Fleix,86,,,860980000B0436,,,,,,,,,,,,,0,,,,,S,sols,,,24,0.748124,46.559593
2019-1318339,2019-12-10,000001,Vente,6530.81,,,PIECE DU THEIL,B045,86300,86098,Fleix,86,,,860980000C0327,,,,,,,,,,,,,0,,,,,T,terres,,,1312,0.748339,46.551622
2019-1318339,2019-12-10,000001,Vente,6530.81,,,LES MAYS,B030,86300,86098,Fleix,86,,,860980000C0456,,,,,,,,,,,,,0,,,,,T,terres,,,15394,0.750417,46.550742
2019-1318405,2019-12-12,000001,Vente,163000,18,,RUE DE LA VALLEE DES CHARMES,0090,86300,86098,Fleix,86,,,860980000B0407,,,,,,,,,,,,,0,1,Maison,103,4,J,jardins,,,1269,0.744697,46.556031
2019-1318405,2019-12-12,000001,Vente,163000,18,,RUE DE LA VALLEE DES CHARMES,0090,86300,86098,Fleix,86,,,860980000B0407,,,,,,,,,,,,,0,1,Maison,103,4,S,sols,,,1000,0.744697,46.556031
