id_mutation,date_mutation,numero_disposition,nature_mutation,valeur_fonciere,adresse_numero,adresse_suffixe,adresse_nom_voie,adresse_code_voie,code_postal,code_commune,nom_commune,code_departement,ancien_code_commune,ancien_nom_commune,id_parcelle,ancien_id_parcelle,numero_volume,lot1_numero,lot1_surface_carrez,lot2_numero,lot2_surface_carrez,lot3_numero,lot3_surface_carrez,lot4_numero,lot4_surface_carrez,lot5_numero,lot5_surface_carrez,nombre_lots,code_type_local,type_local,surface_reelle_bati,nombre_pieces_principales,code_nature_culture,nature_culture,code_nature_culture_speciale,nature_culture_speciale,surface_terrain,longitude,latitude
2019-1308076,2019-02-15,000001,Vente,141250,,,LE HAUT MESSEME,B043,86200,86156,Messemé,86,,,861560000B0468,,,,,,,,,,,,,0,,,,,T,terres,,,1215,0.183383,47.003936
2019-1308076,2019-02-15,000001,Vente,141250,7,,RTE DE CLAUNAY,0015,86200,86156,Messemé,86,,,861560000B0469,,,,,,,,,,,,,0,1,Maison,58,1,S,sols,,,870,0.183514,47.00368
2019-1308076,2019-02-15,000001,Vente,141250,7,,RTE DE CLAUNAY,0015,86200,86156,Messemé,86,,,861560000B0469,,,,,,,,,,,,,0,1,Maison,220,9,S,sols,,,870,0.183514,47.00368
2019-1308076,2019-02-15,000001,Vente,141250,,,LE HAUT MESSEME,B043,86200,86156,Messemé,86,,,861560000B0470,,,,,,,,,,,,,0,,,,,J,jardins,,,450,0.183178,47.003752
2019-1308076,2019-02-15,000001,Vente,141250,,,LE HAUT MESSEME,B043,86200,86156,Messemé,86,,,861560000B0471,,,,,,,,,,,,,0,,,,,T,terres,,,470,0.18291,47.003705
2019-1311336,2019-08-05,000001,Vente,917,,,LE HAUT MESSEME,B043,86200,86156,Messemé,86,,,861560000Y0397,,,,,,,,,,,,,0,,,,,J,jardins,,,754,0.18584,47.003756
2019-1311336,2019-08-05,000001,Vente,917,,,LE HAUT MESSEME,B043,86200,86156,Messemé,86,,,861560000Y0399,,,,,,,,,,,,,0,,,,,J,jardins,,,556,0.186201,47.003588
2019-1311847,2019-08-12,000001,Vente,35000,,,VILLIERS,B082,86200,86156,Messemé,86,,,861560000W0062,,,,,,,,,,,,,0,,,,,J,jardins,,,825,0.16013,47.017919
2019-1311847,2019-08-12,000001,Vente,35000,,,VILLIERS,B082,86200,86156,Messemé,86,,,861560000W0062,,,,,,,,,,,,,0,,,,,S,sols,,,1480,0.16013,47.017919
2019-1311847,2019-08-12,000001,Vente,35000,16,,RUE DE SAMMARCOLLES,0060,86200,86156,Messemé,86,,,861560000W0063,,,,,,,,,,,,,0,1,Maison,120,4,S,sols,,,940,0.159872,47.017977
2019-1312389,2019-09-18,000001,Vente,17000,,,LES CHAPELAINS,B024,86200,86156,Messemé,86,,,861560000V0034,,,,,,,,,,,,,0,,,,,T,terres,,,3490,0.173274,47.01104
2019-1312538,2019-09-18,000001,Vente,580,,,LA GRANGE,B041,86200,86156,Messemé,86,,,86156000ZR0004,,,,,,,,,,,,,0,,,,,T,terres,,,826,0.141674,47.016134
2019-1313132,2019-10-29,000001,Vente,210000,,,CHAMPS DE L HOPITAL,B021,86200,86156,Messemé,86,,,861560000U0247,,,,,,,,,,,,,0,,,,,S,sols,,,662,0.149723,47.008753
2019-1313132,2019-10-29,000001,Vente,210000,,,CHAMPS DE L HOPITAL,B021,86200,86156,Messemé,86,,,861560000U0253,,,,,,,,,,,,,0,,,,,T,terres,,,7180,0.150139,47.008984
2019-1313132,2019-10-29,000001,Vente,210000,,,CHAMPS DE L HOPITAL,B021,86200,86156,Messemé,86,,,861560000U0253,,,,,,,,,,,,,0,,,,,S,sols,,,4000,0.150139,47.008984
2019-1313132,2019-10-29,000001,Vente,210000,5,,RTE DE LA BRUYERE,0005,86200,86156,Messemé,86,,,861560000V0262,,,,,,,,,,,,,0,1,Maison,154,6,S,sols,,,1700,0.151532,47.008811
2019-1313132,2019-10-29,000001,Vente,210000,,,LA BASSE BRUYERE,B002,86200,86156,Messemé,86,,,861560000V0265,,,,,,,,,,,,,0,,,,,J,jardins,,,512,0.151401,47.008745
2019-1313132,2019-10-29,000001,Vente,210000,,,LA BASSE BRUYERE,B002,86200,86156,Messemé,86,,,861560000V0269,,,,,,,,,,,,,0,,,,,T,terres,,,1155,0.151789,47.008991
2019-1313132,2019-10-29,000001,Vente,210000,,,LA BASSE BRUYERE,B002,86200,86156,Messemé,86,,,861560000V0269,,,,,,,,,,,,,0,,,,,S,sols,,,1029,0.151789,47.008991
2019-1313132,2019-10-29,000001,Vente,210000,,,LA BASSE BRUYERE,B002,86200,86156,Messemé,86,,,861560000V0286,,,,,,,,,,,,,0,,,,,T,terres,,,1774,0.152446,47.008755
2019-1313132,2019-10-29,000001,Vente,210000,,,LA BASSE BRUYERE,B002,86200,86156,Messemé,86,,,861560000V0287,,,,,,,,,,,,,0,,,,,T,terres,,,308,0.152459,47.008878
2019-1313132,2019-10-29,000001,Vente,210000,,,LA BASSE BRUYERE,B002,86200,86156,Messemé,86,,,861560000V0288,,,,,,,,,,,,,0,,,,,T,terres,,,79,0.152253,47.009029
2019-1313132,2019-10-29,000001,Vente,210000,,,LA BASSE BRUYERE,B002,86200,86156,Messemé,86,,,861560000V0289,,,,,,,,,,,,,0,,,,,T,terres,,,303,0.15267,47.008862
2019-1313132,2019-10-29,000001,Vente,210000,,,LA BRUYERE,B018,86200,86156,Messemé,86,,,861560000V0291,,,,,,,,,,,,,0,,,,,T,terres,,,1111,0.152775,47.008929
2019-1313132,2019-10-29,000001,Vente,210000,,,LA BRUYERE,B018,86200,86156,Messemé,86,,,861560000V0294,,,,,,,,,,,,,0,,,,,T,terres,,,2658,0.152605,47.009321
2019-1313132,2019-10-29,000001,Vente,210000,,,CHATEAU DE LA MOTTE,B027,86200,86156,Messemé,86,,,86156000ZR0052,,,,,,,,,,,,,0,,,,,T,terres,,,57,0.150209,47.009709
