id_mutation,date_mutation,numero_disposition,nature_mutation,valeur_fonciere,adresse_numero,adresse_suffixe,adresse_nom_voie,adresse_code_voie,code_postal,code_commune,nom_commune,code_departement,ancien_code_commune,ancien_nom_commune,id_parcelle,ancien_id_parcelle,numero_volume,lot1_numero,lot1_surface_carrez,lot2_numero,lot2_surface_carrez,lot3_numero,lot3_surface_carrez,lot4_numero,lot4_surface_carrez,lot5_numero,lot5_surface_carrez,nombre_lots,code_type_local,type_local,surface_reelle_bati,nombre_pieces_principales,code_nature_culture,nature_culture,code_nature_culture_speciale,nature_culture_speciale,surface_terrain,longitude,latitude
2019-1320291,2019-03-29,000001,Vente,20000,5017,,LE BOURG,B007,87120,87132,Saint-Amand-le-Petit,87,,,87132000AB0035,,,,,,,,,,,,,0,1,Maison,56,2,S,sols,,,742,1.751164,45.775645
2019-1320291,2019-03-29,000001,Vente,20000,,,LE BOURG,B007,87120,87132,Saint-Amand-le-Petit,87,,,87132000AB0078,,,,,,,,,,,,,0,,,,,L,landes,,,276,1.750947,45.775309
2019-1320800,2019-04-16,000001,Vente,15000,5071,,BORDELEIX,B004,87120,87132,Saint-Amand-le-Petit,87,,,871320000A0054,,,,,,,,,,,,,0,1,Maison,40,1,S,sols,,,385,1.791086,45.772882
2019-1320800,2019-04-16,000001,Vente,15000,,,BORDELEIX,B004,87120,87132,Saint-Amand-le-Petit,87,,,871320000A0055,,,,,,,,,,,,,0,,,,,J,jardins,,,461,1.791411,45.77277
2019-1320966,2019-04-16,000001,Vente,4500,,,LE BOURG,B007,87120,87132,Saint-Amand-le-Petit,87,,,87132000AB0101,,,,,,,,,,,,,0,,,,,P,prés,,,2553,,
2019-1320966,2019-04-16,000001,Vente,4500,,,LE BOURG,B007,87120,87132,Saint-Amand-le-Petit,87,,,87132000AB0103,,,,,,,,,,,,,0,,,,,S,sols,,,438,,
2019-1320966,2019-04-16,000001,Vente,4500,,,LE BOURG,B007,87120,87132,Saint-Amand-le-Petit,87,,,87132000AB0104,,,,,,,,,,,,,0,,,,,T,terres,,,402,,
2019-1320966,2019-04-16,000001,Vente,4500,,,LE BOURG,B007,87120,87132,Saint-Amand-le-Petit,87,,,87132000AB0104,,,,,,,,,,,,,0,,,,,S,sols,,,500,,
2019-1321936,2019-05-31,000001,Vente,55500,5059,,LA REVEILLERE,B044,87120,87132,Saint-Amand-le-Petit,87,,,871320000B0602,,,,,,,,,,,,,0,1,Maison,68,2,S,sols,,,280,1.771279,45.770356
2019-1321936,2019-05-31,000001,Vente,55500,,,LA REVEILLERE,B044,87120,87132,Saint-Amand-le-Petit,87,,,871320000B0603,,,,,,,,,,,,,0,,,,,J,jardins,,,600,1.771182,45.770197
2019-1322505,2019-07-01,000001,Vente,1000,,,LESSILLADE NORD,B026,87120,87132,Saint-Amand-le-Petit,87,,,871320000C0008,,,,,,,,,,,,,0,,,,,BT,taillis simples,,,760,1.751683,45.768876
2019-1322505,2019-07-01,000001,Vente,1000,,,LE BOURG SUD,B009,87120,87132,Saint-Amand-le-Petit,87,,,871320000C0258,,,,,,,,,,,,,0,,,,,T,terres,,,3760,1.757289,45.775276
2019-1322885,2019-07-02,000001,Vente,5000,,,LE BOURG NORD,B008,87120,87132,Saint-Amand-le-Petit,87,,,871320000C0049,,,,,,,,,,,,,0,,,,,L,landes,,,8,1.746012,45.774603
2019-1322885,2019-07-02,000001,Vente,5000,,,LE BOURG NORD,B008,87120,87132,Saint-Amand-le-Petit,87,,,871320000C0050,,,,,,,,,,,,,0,,,,,PC,pacages,PACAG,Pacage,1360,1.745941,45.774452
2019-1322885,2019-07-02,000001,Vente,5000,,,LE BOURG NORD,B008,87120,87132,Saint-Amand-le-Petit,87,,,871320000C0055,,,,,,,,,,,,,0,,,,,P,prés,,,18310,1.745119,45.775849
2019-1322885,2019-07-02,000001,Vente,5000,,,LE BOURG NORD,B008,87120,87132,Saint-Amand-le-Petit,87,,,871320000C0056,,,,,,,,,,,,,0,,,,,BT,taillis simples,,,6580,1.745653,45.776321
2019-1322885,2019-07-02,000001,Vente,5000,,,LE BOURG NORD,B008,87120,87132,Saint-Amand-le-Petit,87,,,871320000C0060,,,,,,,,,,,,,0,,,,,T,terres,,,3760,1.747236,45.775627
2019-1322885,2019-07-02,000001,Vente,5000,,,LE BOURG NORD,B008,87120,87132,Saint-Amand-le-Petit,87,,,871320000C0063,,,,,,,,,,,,,0,,,,,B,bois,CHAT,Châtaigneraie,515,1.746093,45.774755
2019-1322885,2019-07-02,000001,Vente,5000,,,LES DROUILLES,B015,87120,87132,Saint-Amand-le-Petit,87,,,871320000C0089,,,,,,,,,,,,,0,,,,,BR,futaies résineuses,,,3100,1.750383,45.780206
2019-1322885,2019-07-02,000001,Vente,5000,,,LES DROUILLES,B015,87120,87132,Saint-Amand-le-Petit,87,,,871320000C0100,,,,,,,,,,,,,0,,,,,T,terres,,,4700,1.747014,45.778705
2019-1322885,2019-07-02,000001,Vente,5000,,,LES DROUILLES,B015,87120,87132,Saint-Amand-le-Petit,87,,,871320000C0116,,,,,,,,,,,,,0,,,,,BT,taillis simples,,,2940,1.74929,45.780918
2019-1322885,2019-07-02,000001,Vente,5000,,,LES DROUILLES,B015,87120,87132,Saint-Amand-le-Petit,87,,,871320000C0116,,,,,,,,,,,,,0,,,,,BR,futaies résineuses,,,2940,1.74929,45.780918
2019-1322885,2019-07-02,000001,Vente,5000,,,LES DROUILLES,B015,87120,87132,Saint-Amand-le-Petit,87,,,871320000C0131,,,,,,,,,,,,,0,,,,,BR,futaies résineuses,,,4470,1.750493,45.781148
2019-1322885,2019-07-02,000001,Vente,5000,,,LES DROUILLES,B015,87120,87132,Saint-Amand-le-Petit,87,,,871320000C0133,,,,,,,,,,,,,0,,,,,BT,taillis simples,,,2550,1.751174,45.781255
2019-1322885,2019-07-02,000001,Vente,5000,,,RIBIERE AU LOUP,B045,87120,87132,Saint-Amand-le-Petit,87,,,871320000C0137,,,,,,,,,,,,,0,,,,,BT,taillis simples,,,4810,1.751425,45.783114
2019-1322885,2019-07-02,000001,Vente,5000,,,RIBIERE AU LOUP,B045,87120,87132,Saint-Amand-le-Petit,87,,,871320000C0138,,,,,,,,,,,,,0,,,,,T,terres,,,7480,1.751924,45.783361
2019-1322885,2019-07-02,000001,Vente,5000,,,RIBIERE AU LOUP,B045,87120,87132,Saint-Amand-le-Petit,87,,,871320000C0144,,,,,,,,,,,,,0,,,,,T,terres,,,4080,1.751732,45.781066
2019-1325172,2019-09-27,000001,Vente,80000,5006,,LE BOURG,B007,87120,87132,Saint-Amand-le-Petit,87,,,87132000AB0064,,,,,,,,,,,,,0,1,Maison,100,5,S,sols,,,298,1.752499,45.774762
2019-1325172,2019-09-27,000001,Vente,80000,,,LE BOURG,B007,87120,87132,Saint-Amand-le-Petit,87,,,87132000AB0065,,,,,,,,,,,,,0,,,,,P,prés,,,580,1.752465,45.774701
2019-1325172,2019-09-27,000001,Vente,80000,,,LE BOURG,B007,87120,87132,Saint-Amand-le-Petit,87,,,87132000AB0066,,,,,,,,,,,,,0,,,,,J,jardins,,,268,1.752166,45.774656
2019-1325173,2019-09-27,000001,Vente,583.1,,,LE BOURG,B007,87120,87132,Saint-Amand-le-Petit,87,,,87132000AB0149,,,,,,,,,,,,,0,,,,,P,prés,,,833,1.75243,45.774494
2019-1326697,2019-11-22,000001,Vente,5000,,,LES DROUILLES,B015,87120,87132,Saint-Amand-le-Petit,87,,,871320000C0136,,,,,,,,,,,,,0,,,,,BT,taillis simples,,,1760,1.750877,45.782595
2019-1326697,2019-11-22,000001,Vente,5000,,,LE BOURG SUD,B009,87120,87132,Saint-Amand-le-Petit,87,,,871320000C0243,,,,,,,,,,,,,0,,,,,T,terres,,,9410,1.752298,45.777166
2019-1326697,2019-11-22,000001,Vente,5000,,,LE BOURG SUD,B009,87120,87132,Saint-Amand-le-Petit,87,,,871320000C0243,,,,,,,,,,,,,0,,,,,T,terres,,,9410,1.752298,45.777166
2019-1327592,2019-12-20,000001,Vente,67000,5011,A,LE BOURG,B007,87120,87132,Saint-Amand-le-Petit,87,,,87132000AB0094,,,,,,,,,,,,,0,1,Maison,105,3,S,sols,,,414,1.75108,45.774841
