id_mutation,date_mutation,numero_disposition,nature_mutation,valeur_fonciere,adresse_numero,adresse_suffixe,adresse_nom_voie,adresse_code_voie,code_postal,code_commune,nom_commune,code_departement,ancien_code_commune,ancien_nom_commune,id_parcelle,ancien_id_parcelle,numero_volume,lot1_numero,lot1_surface_carrez,lot2_numero,lot2_surface_carrez,lot3_numero,lot3_surface_carrez,lot4_numero,lot4_surface_carrez,lot5_numero,lot5_surface_carrez,nombre_lots,code_type_local,type_local,surface_reelle_bati,nombre_pieces_principales,code_nature_culture,nature_culture,code_nature_culture_speciale,nature_culture_speciale,surface_terrain,longitude,latitude
2019-1329304,2019-03-26,000001,Vente,1800,,,DAVIOT,B031,88260,88138,Dombasle-devant-Darney,88,,,881380000B0282,,,,,,,,,,,,,0,,,,,B,bois,AULN,Aulnaie,3412,6.05707,48.117079
2019-1329304,2019-03-26,000001,Vente,1800,,,DAVIOT,B031,88260,88138,Dombasle-devant-Darney,88,,,881380000B0702,,,,,,,,,,,,,0,,,,,B,bois,AULN,Aulnaie,3190,6.057589,48.116981
2019-1329309,2019-03-26,000001,Vente,720,,,SOUS MAISON,B086,88260,88138,Dombasle-devant-Darney,88,,,881380000B0467,,,,,,,,,,,,,0,,,,,P,prés,,,1405,6.078673,48.125684
2019-1329549,2019-04-24,000001,Vente,3400,,,SOUS MAISON,B086,88260,88138,Dombasle-devant-Darney,88,,,881380000B0469,,,,,,,,,,,,,0,,,,,B,bois,AULN,Aulnaie,7500,6.079725,48.124701
2019-1329549,2019-04-24,000001,Vente,3400,,,SOUS MAISON,B086,88260,88138,Dombasle-devant-Darney,88,,,881380000B0472,,,,,,,,,,,,,0,,,,,B,bois,AULN,Aulnaie,477,6.079376,48.125027
2019-1330121,2019-06-07,000001,Vente,614.1,,,LES PERDERIES 2EME POINTIE,B075,88260,88138,Dombasle-devant-Darney,88,,,881380000B0692,,,,,,,,,,,,,0,,,,,P,prés,,,2047,6.079713,48.122694
2019-1330377,2019-06-06,000001,Vente,13885,,,HAUTE BORNE,B095,88260,88138,Dombasle-devant-Darney,88,,,88138000ZA0022,,,,,,,,,,,,,0,,,,,T,terres,,,12701,6.098248,48.139719
2019-1330377,2019-06-06,000001,Vente,13885,,,HAUTE BORNE,B095,88260,88138,Dombasle-devant-Darney,88,,,88138000ZA0022,,,,,,,,,,,,,0,,,,,T,terres,,,6351,6.098248,48.139719
2019-1330377,2019-06-06,000001,Vente,13885,,,HAUTE BORNE,B095,88260,88138,Dombasle-devant-Darney,88,,,88138000ZA0024,,,,,,,,,,,,,0,,,,,P,prés,,,578,6.099546,48.13986
2019-1330377,2019-06-06,000001,Vente,13885,,,HAUTE BORNE,B095,88260,88138,Dombasle-devant-Darney,88,,,88138000ZA0026,,,,,,,,,,,,,0,,,,,P,prés,,,519,6.099591,48.139524
2019-1330823,2019-07-01,000001,Vente,6000,23,,VOIE DE BELRUPT,0062,88260,88138,Dombasle-devant-Darney,88,,,881380000C0238,,,,,,,,,,,,,0,1,Maison,60,1,S,sols,,,173,6.076601,48.125258
2019-1330823,2019-07-01,000001,Vente,6000,,,VOIE DE BELRUPT,B092,88260,88138,Dombasle-devant-Darney,88,,,881380000C0384,,,,,,,,,,,,,0,,,,,VE,vergers,,,99,6.076663,48.125276
2019-1330823,2019-07-01,000001,Vente,6000,,,VOIE DE BELRUPT,B092,88260,88138,Dombasle-devant-Darney,88,,,881380000C0387,,,,,,,,,,,,,0,,,,,S,sols,,,8,6.076515,48.125223
2019-1331057,2019-07-17,000001,Vente,2000,,,LA GROSSE AULNE,B058,88260,88138,Dombasle-devant-Darney,88,,,881380000A0153,,,,,,,,,,,,,0,,,,,B,bois,AULN,Aulnaie,7390,6.05874,48.131586
2019-1332430,2019-10-24,000001,Vente,17100,,,CHAMPS DU BREUIL,B018,88260,88138,Dombasle-devant-Darney,88,,,881380000B0050,,,,,,,,,,,,,0,,,,,P,prés,,,1590,6.067245,48.124634
2019-1332430,2019-10-24,000001,Vente,17100,,,CHAMPS DU BREUIL,B018,88260,88138,Dombasle-devant-Darney,88,,,881380000B0053,,,,,,,,,,,,,0,,,,,P,prés,,,2270,6.068512,48.123965
2019-1332430,2019-10-24,000001,Vente,17100,,,CHAMPS DU BREUIL,B018,88260,88138,Dombasle-devant-Darney,88,,,881380000B0054,,,,,,,,,,,,,0,,,,,P,prés,,,9990,6.068004,48.123999
2019-1332430,2019-10-24,000001,Vente,17100,,,ROND BOIS,B080,88260,88138,Dombasle-devant-Darney,88,,,881380000B0418,,,,,,,,,,,,,0,,,,,P,prés,,,3355,6.064773,48.125592
2019-1332430,2019-10-24,000001,Vente,17100,,,LA CROISETTE,B028,88260,88138,Dombasle-devant-Darney,88,,,881380000B0640,,,,,,,,,,,,,0,,,,,P,prés,,,6000,6.081427,48.120072
2019-1332430,2019-10-24,000001,Vente,17100,,,LA CROISETTE,B028,88260,88138,Dombasle-devant-Darney,88,,,881380000B0641,,,,,,,,,,,,,0,,,,,P,prés,,,740,6.081876,48.119675
2019-1332430,2019-10-24,000001,Vente,17100,,,LA CROISETTE,B028,88260,88138,Dombasle-devant-Darney,88,,,881380000B0642,,,,,,,,,,,,,0,,,,,P,prés,,,1580,6.082161,48.119953
2019-1332430,2019-10-24,000001,Vente,17100,,,LA CROISETTE,B028,88260,88138,Dombasle-devant-Darney,88,,,881380000B0643,,,,,,,,,,,,,0,,,,,P,prés,,,2208,6.081422,48.120526
2019-1332430,2019-10-24,000001,Vente,17100,,,LA CROISETTE,B028,88260,88138,Dombasle-devant-Darney,88,,,881380000B0644,,,,,,,,,,,,,0,,,,,P,prés,,,972,6.08152,48.120653
2019-1332430,2019-10-24,000001,Vente,17100,,,GUET DE BELRUPT,B060,88260,88138,Dombasle-devant-Darney,88,,,881380000B0683,,,,,,,,,,,,,0,,,,,P,prés,,,7200,6.080171,48.121395
2019-1332430,2019-10-24,000001,Vente,17100,,,DERRIERE CHEZ MON COEUR,B033,88260,88138,Dombasle-devant-Darney,88,,,881380000C0107,,,,,,,,,,,,,0,,,,,T,terres,,,279,6.076043,48.129829
2019-1332430,2019-10-24,000001,Vente,17100,,,DERRIERE CHEZ MON COEUR,B033,88260,88138,Dombasle-devant-Darney,88,,,881380000C0108,,,,,,,,,,,,,0,,,,,VE,vergers,,,822,6.07638,48.130105
2019-1332430,2019-10-24,000001,Vente,17100,,,DERRIERE CHEZ MON COEUR,B033,88260,88138,Dombasle-devant-Darney,88,,,881380000C0109,,,,,,,,,,,,,0,,,,,VE,vergers,,,567,6.076511,48.129984
2019-1332430,2019-10-24,000001,Vente,17100,,,DERRIERE CHEZ MON COEUR,B033,88260,88138,Dombasle-devant-Darney,88,,,881380000C0110,,,,,,,,,,,,,0,,,,,T,terres,,,243,6.076219,48.129741
2019-1333353,2019-12-30,000001,Vente,10000,,,LE BREUIL,B010,88260,88138,Dombasle-devant-Darney,88,,,881380000C0031,,,,,,,,,,,,,0,,,,,VE,vergers,,,368,6.073534,48.127224
2019-1333353,2019-12-30,000001,Vente,10000,,,RUE SAINT BASLE,0049,88260,88138,Dombasle-devant-Darney,88,,,881380000C0033,,,,,,,,,,,,,0,1,Maison,45,2,S,sols,,,380,6.073866,48.127521
2019-1333353,2019-12-30,000001,Vente,10000,,,LES GRANDS JARDINS,B057,88260,88138,Dombasle-devant-Darney,88,,,881380000C0422,,,,,,,,,,,,,0,,,,,S,sols,,,615,6.073861,48.127502
