id_mutation,date_mutation,numero_disposition,nature_mutation,valeur_fonciere,adresse_numero,adresse_suffixe,adresse_nom_voie,adresse_code_voie,code_postal,code_commune,nom_commune,code_departement,ancien_code_commune,ancien_nom_commune,id_parcelle,ancien_id_parcelle,numero_volume,lot1_numero,lot1_surface_carrez,lot2_numero,lot2_surface_carrez,lot3_numero,lot3_surface_carrez,lot4_numero,lot4_surface_carrez,lot5_numero,lot5_surface_carrez,nombre_lots,code_type_local,type_local,surface_reelle_bati,nombre_pieces_principales,code_nature_culture,nature_culture,code_nature_culture_speciale,nature_culture_speciale,surface_terrain,longitude,latitude
2019-1329250,2019-04-10,000001,Vente,2500,,,FRAIN VILLAGE,B064,88320,88180,Frain,88,,,881800000D0581,,,,,,,,,,,,,0,,,,,S,sols,,,26,5.878842,48.086084
2019-1329250,2019-04-10,000001,Vente,2500,,,FRAIN VILLAGE,B064,88320,88180,Frain,88,,,881800000D0643,,,,,,,,,,,,,0,,,,,S,sols,,,100,5.878544,48.086237
2019-1329516,2019-04-13,000001,Vente,106000,29,,RUE PRINCIPALE,0066,88320,88180,Frain,88,,,881800000D0097,,,,,,,,,,,,,0,1,Maison,140,5,S,sols,,,480,5.876634,48.086697
2019-1329516,2019-04-13,000001,Vente,106000,,,LA VEAU,B132,88320,88180,Frain,88,,,881800000D0637,,,,,,,,,,,,,0,,,,,VE,vergers,,,1553,5.876809,48.087015
2019-1329791,2019-05-22,000001,Vente,67000,,,LE MARGUELE,B091,88320,88180,Frain,88,,,881800000D0460,,,,,,,,,,,,,0,,,,,VE,vergers,,,302,5.88354,48.08476
2019-1329791,2019-05-22,000001,Vente,67000,,,LE MARGUELE,B091,88320,88180,Frain,88,,,881800000D0461,,,,,,,,,,,,,0,,,,,VE,vergers,,,301,5.883509,48.084548
2019-1329791,2019-05-22,000001,Vente,67000,62,,RUE PRINCIPALE,0066,88320,88180,Frain,88,,,881800000D0462,,,,,,,,,,,,,0,1,Maison,80,4,S,sols,,,309,5.883424,48.084837
2019-1330009,2019-06-07,000001,Vente,612,,,LA ROZIERE,B123,88320,88180,Frain,88,,,881800000D0492,,,,,,,,,,,,,0,,,,,J,jardins,,,200,5.878237,48.085185
2019-1330009,2019-06-07,000001,Vente,612,,,LA SAUCE,B126,88320,88180,Frain,88,,,88180000ZB0014,,,,,,,,,,,,,0,,,,,VE,vergers,,,961,5.880211,48.091816
2019-1330009,2019-06-07,000001,Vente,612,,,LA SAUCE,B126,88320,88180,Frain,88,,,88180000ZB0015,,,,,,,,,,,,,0,,,,,VE,vergers,,,881,5.880273,48.091768
2019-1331313,2019-08-20,000001,Vente,25812,14,,RUE HAUTE,0050,88320,88180,Frain,88,,,881800000D0266,,,,,,,,,,,,,0,1,Maison,40,2,S,sols,,,628,5.878298,48.087888
2019-1331458,2019-09-13,000001,Vente,43000,,,LA HAYE DU CORBEAU,B086,88320,88180,Frain,88,,,881800000D0276,,,,,,,,,,,,,0,,,,,VE,vergers,,,908,5.879301,48.088029
2019-1331458,2019-09-13,000001,Vente,43000,,,LA HAYE DU CORBEAU,B086,88320,88180,Frain,88,,,881800000D0277,,,,,,,,,,,,,0,,,,,VE,vergers,,,300,5.879341,48.087913
2019-1331458,2019-09-13,000001,Vente,43000,,,LA HAYE DU CORBEAU,B086,88320,88180,Frain,88,,,881800000D0280,,,,,,,,,,,,,0,,,,,VE,vergers,,,1120,5.879608,48.087407
2019-1331458,2019-09-13,000001,Vente,43000,,,LA HAYE DU CORBEAU,B086,88320,88180,Frain,88,,,881800000D0282,,,,,,,,,,,,,0,,,,,VE,vergers,,,420,5.880092,48.087233
2019-1331458,2019-09-13,000001,Vente,43000,,,TRICHEMONIA,B129,88320,88180,Frain,88,,,881800000D0285,,,,,,,,,,,,,0,,,,,VE,vergers,,,7249,5.880159,48.087732
2019-1331458,2019-09-13,000001,Vente,43000,14,,RUE DU PICARD,0062,88320,88180,Frain,88,,,881800000D0289,,,,,,,,,,,,,0,1,Maison,86,3,S,sols,,,384,5.880201,48.086736
2019-1331458,2019-09-13,000001,Vente,43000,,,LA COTE BROCHOT,B041,88320,88180,Frain,88,,,881800000D0290,,,,,,,,,,,,,0,,,,,VE,vergers,,,2616,5.880528,48.08712
2019-1331458,2019-09-13,000001,Vente,43000,,,LA COTE BROCHOT,B041,88320,88180,Frain,88,,,881800000D0295,,,,,,,,,,,,,0,,,,,VE,vergers,,,280,5.881048,48.08711
2019-1331458,2019-09-13,000001,Vente,43000,,,LA COTE BROCHOT,B041,88320,88180,Frain,88,,,881800000D0297,,,,,,,,,,,,,0,,,,,VE,vergers,,,430,5.880709,48.087037
2019-1331458,2019-09-13,000001,Vente,43000,,,LA COTE BROCHOT,B041,88320,88180,Frain,88,,,881800000D0298,,,,,,,,,,,,,0,,,,,VE,vergers,,,122,5.880776,48.086869
2019-1331458,2019-09-13,000001,Vente,43000,,,LA COTE BROCHOT,B041,88320,88180,Frain,88,,,881800000D0299,,,,,,,,,,,,,0,,,,,VE,vergers,,,158,5.880611,48.086739
2019-1331458,2019-09-13,000001,Vente,43000,,,LA HAYE DU CORBEAU,B086,88320,88180,Frain,88,,,881800000D0710,,,,,,,,,,,,,0,,,,,VE,vergers,,,41,5.879948,48.086852
2019-1331458,2019-09-13,000001,Vente,43000,,,LA RENOTTE,B120,88320,88180,Frain,88,,,88180000ZB0044,,,,,,,,,,,,,0,,,,,T,terres,,,4612,5.883253,48.087688
2019-1332504,2019-11-22,000001,Vente,3300,,,LES COTES SUD,B045,88320,88180,Frain,88,,,881800000C0460,,,,,,,,,,,,,0,,,,,P,prés,,,3030,5.874181,48.080441
2019-1332504,2019-11-22,000001,Vente,3300,,,SUR LES VIGNES LANDANGER,B134,88320,88180,Frain,88,,,881800000C0475,,,,,,,,,,,,,0,,,,,BT,taillis simples,,,3280,5.873612,48.081777
2019-1332504,2019-11-22,000001,Vente,3300,,,SUR LES VIGNES LANDANGER,B134,88320,88180,Frain,88,,,881800000C0621,,,,,,,,,,,,,0,,,,,BT,taillis simples,,,530,5.873389,48.08174
2019-1332505,2019-11-22,000002,Vente,1000,,,LE CARMANTRANT,B018,88320,88180,Frain,88,,,881800000D0535,,,,,,,,,,,,,0,,,,,S,sols,,,77,5.876068,48.086049
2019-1332505,2019-11-22,000002,Vente,1000,,,LE CARMANTRANT,B018,88320,88180,Frain,88,,,881800000D0535,,,,,,,,,,,,,0,,,,,VE,vergers,,,1556,5.876068,48.086049
2019-1332657,2019-11-22,000001,Echange,2700,,,LA VOIE DU RENARD,B142,88320,88180,Frain,88,,,881800000C0135,,,,,,,,,,,,,0,,,,,BT,taillis simples,,,1230,5.870612,48.08596
2019-1332657,2019-11-22,000001,Echange,2700,,,LA VOIE DU RENARD,B142,88320,88180,Frain,88,,,881800000C0136,,,,,,,,,,,,,0,,,,,VE,vergers,,,400,5.871094,48.086081
2019-1332657,2019-11-22,000001,Echange,2700,,,LES BONDEURES,B009,88320,88180,Frain,88,,,881800000C0151,,,,,,,,,,,,,0,,,,,VE,vergers,,,1080,5.871634,48.085415
2019-1332657,2019-11-22,000001,Echange,2700,,,LES BONDEURES,B009,88320,88180,Frain,88,,,881800000C0154,,,,,,,,,,,,,0,,,,,BT,taillis simples,,,500,5.870965,48.085634
2019-1332657,2019-11-22,000001,Echange,2700,,,LES BONDEURES,B009,88320,88180,Frain,88,,,881800000C0155,,,,,,,,,,,,,0,,,,,BT,taillis simples,,,490,5.870491,48.085498
2019-1332657,2019-11-22,000001,Echange,2700,,,LES BONDEURES,B009,88320,88180,Frain,88,,,881800000C0156,,,,,,,,,,,,,0,,,,,BT,taillis simples,,,1165,5.870964,48.08555
2019-1332657,2019-11-22,000001,Echange,2700,,,LES BONDEURES,B009,88320,88180,Frain,88,,,881800000C0157,,,,,,,,,,,,,0,,,,,BT,taillis simples,,,930,5.871071,48.085384
2019-1332657,2019-11-22,000001,Echange,2700,,,LES BONDEURES,B009,88320,88180,Frain,88,,,881800000C0158,,,,,,,,,,,,,0,,,,,BT,taillis simples,,,3110,5.871021,48.085163
2019-1332658,2019-11-22,000002,Echange,3300,,,LES COTES SUD,B045,88320,88180,Frain,88,,,881800000C0460,,,,,,,,,,,,,0,,,,,P,prés,,,3030,5.874181,48.080441
2019-1332658,2019-11-22,000002,Echange,3300,,,SUR LES VIGNES LANDANGER,B134,88320,88180,Frain,88,,,881800000C0475,,,,,,,,,,,,,0,,,,,BT,taillis simples,,,3280,5.873612,48.081777
2019-1332658,2019-11-22,000002,Echange,3300,,,SUR LES VIGNES LANDANGER,B134,88320,88180,Frain,88,,,881800000C0621,,,,,,,,,,,,,0,,,,,BT,taillis simples,,,530,5.873389,48.08174
