id_mutation,date_mutation,numero_disposition,nature_mutation,valeur_fonciere,adresse_numero,adresse_suffixe,adresse_nom_voie,adresse_code_voie,code_postal,code_commune,nom_commune,code_departement,ancien_code_commune,ancien_nom_commune,id_parcelle,ancien_id_parcelle,numero_volume,lot1_numero,lot1_surface_carrez,lot2_numero,lot2_surface_carrez,lot3_numero,lot3_surface_carrez,lot4_numero,lot4_surface_carrez,lot5_numero,lot5_surface_carrez,nombre_lots,code_type_local,type_local,surface_reelle_bati,nombre_pieces_principales,code_nature_culture,nature_culture,code_nature_culture_speciale,nature_culture_speciale,surface_terrain,longitude,latitude
2019-1328166,2019-01-09,000001,Vente,150,,,CHEVILLOT,B015,88410,88272,Lironcourt,88,,,882720000A0472,,,,,,,,,,,,,0,,,,,VI,vignes,,,515,5.859871,47.971543
2019-1328446,2019-02-06,000001,Vente,300,,,CHEVILLOT,B015,88410,88272,Lironcourt,88,,,882720000A0467,,,,,,,,,,,,,0,,,,,L,landes,FRICH,Friche,356,5.861213,47.971566
2019-1328446,2019-02-06,000001,Vente,300,,,CHEVILLOT,B015,88410,88272,Lironcourt,88,,,882720000A0469,,,,,,,,,,,,,0,,,,,VI,vignes,,,770,5.860654,47.971605
2019-1328446,2019-02-06,000001,Vente,300,,,CHEVILLOT,B015,88410,88272,Lironcourt,88,,,882720000A0470,,,,,,,,,,,,,0,,,,,L,landes,FRICH,Friche,595,5.860217,47.971628
2019-1328446,2019-02-06,000001,Vente,300,,,CHEVILLOT,B015,88410,88272,Lironcourt,88,,,882720000A0471,,,,,,,,,,,,,0,,,,,VI,vignes,,,1535,5.860596,47.971508
2019-1328920,2019-03-20,000001,Vente,15000,2,,RUE DE CHARMONT,0001,88410,88272,Lironcourt,88,,,88272000ZB0124,,,,,,,,,,,,,0,1,Maison,105,5,S,sols,,,460,5.893624,47.969669
2019-1329991,2019-05-29,000001,Vente,14000,,,LE FOND DES PLANTES,B026,88410,88272,Lironcourt,88,,,882720000A0063,,,,,,,,,,,,,0,,,,,VI,vignes,,,930,5.859759,47.974518
2019-1329991,2019-05-29,000001,Vente,14000,,,LES PLANTES,B045,88410,88272,Lironcourt,88,,,882720000A0412,,,,,,,,,,,,,0,,,,,L,landes,FRICH,Friche,1190,5.862072,47.973385
2019-1330372,2019-06-14,000001,Vente,3846,,,SOUS CORBE,B088,88410,88272,Lironcourt,88,,,88272000ZE0023,,,,,,,,,,,,,0,,,,,T,terres,,,10988,5.869777,47.972809
2019-1330711,2019-06-27,000001,Vente,800,,,LA GIGER,B028,88410,88272,Lironcourt,88,,,882720000A0020,,,,,,,,,,,,,0,,,,,L,landes,FRICH,Friche,1825,5.856543,47.974449
2019-1330711,2019-06-27,000001,Vente,800,,,LE CORBE,B016,88410,88272,Lironcourt,88,,,882720000A0129,,,,,,,,,,,,,0,,,,,L,landes,FRICH,Friche,1904,5.863685,47.975438
