id_mutation,date_mutation,numero_disposition,nature_mutation,valeur_fonciere,adresse_numero,adresse_suffixe,adresse_nom_voie,adresse_code_voie,code_postal,code_commune,nom_commune,code_departement,ancien_code_commune,ancien_nom_commune,id_parcelle,ancien_id_parcelle,numero_volume,lot1_numero,lot1_surface_carrez,lot2_numero,lot2_surface_carrez,lot3_numero,lot3_surface_carrez,lot4_numero,lot4_surface_carrez,lot5_numero,lot5_surface_carrez,nombre_lots,code_type_local,type_local,surface_reelle_bati,nombre_pieces_principales,code_nature_culture,nature_culture,code_nature_culture_speciale,nature_culture_speciale,surface_terrain,longitude,latitude
2019-1334327,2019-05-15,000001,Vente,8000,6,B,RUE DE LA BASSE DES LOGES,0011,88110,88277,Luvigny,88,,,882770000A0494,,,,,,,,,,,,,0,,,,,S,sols,,,384,7.069674,48.499598
2019-1334327,2019-05-15,000001,Vente,8000,,,LES PETITS CHAMPS,B032,88110,88277,Luvigny,88,,,882770000A1031,,,,,,,,,,,,,0,,,,,T,terres,,,639,7.069363,48.499579
2019-1334327,2019-05-15,000001,Vente,8000,,,LES PETITS CHAMPS,B032,88110,88277,Luvigny,88,,,882770000A1033,,,,,,,,,,,,,0,,,,,T,terres,,,306,7.069418,48.499438
2019-1335521,2019-09-25,000001,Vente,64400,5,,RUE DE LA SCIERIE,0057,88110,88277,Luvigny,88,,,882770000A0385,,,,,,,,,,,,,0,1,Maison,100,5,S,sols,,,135,7.069529,48.501724
2019-1335521,2019-09-25,000001,Vente,64400,,,LE VILLAGE,B045,88110,88277,Luvigny,88,,,882770000A0967,,,,,,,,,,,,,0,,,,,T,terres,,,19,7.069456,48.501689
2019-1335728,2019-10-30,000001,Vente,29000,,,MEIX LADELAT,B027,88110,88277,Luvigny,88,,,882770000A0951,,,,,,,,,,,,,0,,,,,L,landes,FRICH,Friche,651,7.066473,48.49928
2019-1335728,2019-10-30,000001,Vente,29000,3,,GR GRANDE RUE,0025,88110,88277,Luvigny,88,,,882770000A1021,,,,,,,,,,,,,0,1,Maison,55,4,S,sols,,,605,7.066035,48.499359
2019-1335728,2019-10-30,000001,Vente,29000,3,,GR GRANDE RUE,0025,88110,88277,Luvigny,88,,,882770000A1021,,,,,,,,,,,,,0,1,Maison,55,4,P,prés,,,2121,7.066035,48.499359
