id_mutation,date_mutation,numero_disposition,nature_mutation,valeur_fonciere,adresse_numero,adresse_suffixe,adresse_nom_voie,adresse_code_voie,code_postal,code_commune,nom_commune,code_departement,ancien_code_commune,ancien_nom_commune,id_parcelle,ancien_id_parcelle,numero_volume,lot1_numero,lot1_surface_carrez,lot2_numero,lot2_surface_carrez,lot3_numero,lot3_surface_carrez,lot4_numero,lot4_surface_carrez,lot5_numero,lot5_surface_carrez,nombre_lots,code_type_local,type_local,surface_reelle_bati,nombre_pieces_principales,code_nature_culture,nature_culture,code_nature_culture_speciale,nature_culture_speciale,surface_terrain,longitude,latitude
2019-1329177,2019-03-15,000001,Vente,143890,,,CHENEVIERES DEVANT LA CROI,B005,88500,88364,Puzieux,88,,,883640000C0197,,,,,,,,,,,,,0,,,,,S,sols,,,1823,6.098498,48.33449
2019-1329177,2019-03-15,000001,Vente,143890,,,CHENEVIERES DEVANT LA CROI,B005,88500,88364,Puzieux,88,,,883640000C0424,,,,,,,,,,,,,0,,,,,VE,vergers,,,156,6.098794,48.33438
2019-1329177,2019-03-15,000001,Vente,143890,,,LES FOURNELS,B014,88500,88364,Puzieux,88,,,88364000ZD0105,,,,,,,,,,,,,0,,,,,P,prés,,,1074,6.099338,48.334176
2019-1329177,2019-03-15,000001,Vente,143890,,,LES FOURNELS,B014,88500,88364,Puzieux,88,,,88364000ZD0107,,,,,,,,,,,,,0,,,,,P,prés,,,5246,6.099479,48.334476
2019-1329177,2019-03-15,000001,Vente,143890,,,LES FOURNELS,B014,88500,88364,Puzieux,88,,,88364000ZD0107,,,,,,,,,,,,,0,,,,,S,sols,,,2500,6.099479,48.334476
2019-1329801,2019-05-27,000001,Vente,,,,LES FOURNELS,B014,88500,88364,Puzieux,88,,,88364000ZD0090,,,,,,,,,,,,,0,,,,,P,prés,,,3414,6.100686,48.332817
2019-1329801,2019-05-27,000001,Vente,,,,LES FOURNELS,B014,88500,88364,Puzieux,88,,,88364000ZD0090,,,,,,,,,,,,,0,,,,,P,prés,,,3414,6.100686,48.332817
2019-1332687,2019-11-29,000001,Vente,1200,,,VIGNES DU RUISSEAU,B034,88500,88364,Puzieux,88,,,883640000A0761,,,,,,,,,,,,,0,,,,,L,landes,FRICH,Friche,1170,6.113489,48.336786
2019-1332687,2019-11-29,000001,Vente,1200,,,VIGNES DU RUISSEAU,B034,88500,88364,Puzieux,88,,,883640000A0763,,,,,,,,,,,,,0,,,,,L,landes,FRICH,Friche,820,6.112988,48.336843
