id_mutation,date_mutation,numero_disposition,nature_mutation,valeur_fonciere,adresse_numero,adresse_suffixe,adresse_nom_voie,adresse_code_voie,code_postal,code_commune,nom_commune,code_departement,ancien_code_commune,ancien_nom_commune,id_parcelle,ancien_id_parcelle,numero_volume,lot1_numero,lot1_surface_carrez,lot2_numero,lot2_surface_carrez,lot3_numero,lot3_surface_carrez,lot4_numero,lot4_surface_carrez,lot5_numero,lot5_surface_carrez,nombre_lots,code_type_local,type_local,surface_reelle_bati,nombre_pieces_principales,code_nature_culture,nature_culture,code_nature_culture_speciale,nature_culture_speciale,surface_terrain,longitude,latitude
2019-1338496,2019-02-22,000001,Vente,142000,5001,F,RUE GLACEE,0090,89360,89205,Jaulges,89,,,89205000ZO0161,,,,,,,,,,,,,0,1,Maison,97,4,S,sols,,,500,3.787431,47.959083
2019-1338496,2019-02-22,000001,Vente,142000,5001,F,RUE GLACEE,0090,89360,89205,Jaulges,89,,,89205000ZO0161,,,,,,,,,,,,,0,1,Maison,97,4,J,jardins,,,887,3.787431,47.959083
2019-1338726,2019-03-26,000001,Vente,81390,,,LE VILLAGE OUEST,B083,89360,89205,Jaulges,89,,,89205000AN0020,,,,,,,,,,,,,0,,,,,S,sols,,,104,3.786775,47.962694
2019-1338726,2019-03-26,000001,Vente,81390,,,LE VILLAGE OUEST,B083,89360,89205,Jaulges,89,,,89205000AN0175,,,,,,,,,,,,,0,,,,,S,sols,,,161,3.786965,47.962649
2019-1338726,2019-03-26,000001,Vente,81390,39,,GR GRANDE RUE,0095,89360,89205,Jaulges,89,,,89205000AN0220,,,,,,,,,,,,,0,1,Maison,80,2,S,sols,,,305,3.786883,47.962802
2019-1338726,2019-03-26,000001,Vente,81390,,,LE VILLAGE OUEST,B083,89360,89205,Jaulges,89,,,89205000AN0223,,,,,,,,,,,,,0,,,,,S,sols,,,51,3.786969,47.96276
2019-1338876,2019-04-10,000001,Vente,700,,,LE VILLAGE OUEST,B083,89360,89205,Jaulges,89,,,89205000AN0026,,,,,,,,,,,,,0,,,,,J,jardins,,,276,3.786656,47.96297
2019-1340038,2019-09-18,000001,Vente,10419.2,,,PREPU,B064,89360,89205,Jaulges,89,,,89205000ZN0016,,,,,,,,,,,,,0,,,,,T,terres,,,6000,3.778157,47.95648
2019-1340038,2019-09-18,000001,Vente,10419.2,,,PREPU,B064,89360,89205,Jaulges,89,,,89205000ZN0017,,,,,,,,,,,,,0,,,,,T,terres,,,13290,3.778512,47.956329
2019-1340038,2019-09-18,000001,Vente,10419.2,,,LES PRES DE SAULIGNON,B066,89360,89205,Jaulges,89,,,89205000ZO0029,,,,,,,,,,,,,0,,,,,T,terres,,,13270,3.789581,47.967056
2019-1340039,2019-09-18,000001,Vente,7347.2,,,LE GRAND ETANG,B038,89360,89205,Jaulges,89,,,89205000ZK0015,,,,,,,,,,,,,0,,,,,P,prés,,,22960,3.797897,47.959563
2019-1340390,2019-10-28,000001,Vente,75000,7,,RUE DE L ARMANCON,0010,89360,89205,Jaulges,89,,,89205000ZO0034,,,,,,,,,,,,,0,1,Maison,68,3,S,sols,,,168,3.792417,47.964982
2019-1340390,2019-10-28,000001,Vente,75000,7,,RUE DE L ARMANCON,0010,89360,89205,Jaulges,89,,,89205000ZO0034,,,,,,,,,,,,,0,1,Maison,68,3,T,terres,,,882,3.792417,47.964982
2019-1340831,2019-11-27,000001,Vente,1000,,,LA CROIX SAINT ROCH,B021,89360,89205,Jaulges,89,,,89205000ZI0092,,,,,,,,,,,,,0,,,,,S,sols,,,57,3.793616,47.966835
