id_mutation,date_mutation,numero_disposition,nature_mutation,valeur_fonciere,adresse_numero,adresse_suffixe,adresse_nom_voie,adresse_code_voie,code_postal,code_commune,nom_commune,code_departement,ancien_code_commune,ancien_nom_commune,id_parcelle,ancien_id_parcelle,numero_volume,lot1_numero,lot1_surface_carrez,lot2_numero,lot2_surface_carrez,lot3_numero,lot3_surface_carrez,lot4_numero,lot4_surface_carrez,lot5_numero,lot5_surface_carrez,nombre_lots,code_type_local,type_local,surface_reelle_bati,nombre_pieces_principales,code_nature_culture,nature_culture,code_nature_culture_speciale,nature_culture_speciale,surface_terrain,longitude,latitude
2019-1344625,2019-01-02,000001,Vente,175000,4,T,CHE D ARGENT,0010,89100,89354,Saint-Martin-du-Tertre,89,,,89354000ZD0294,,,,,,,,,,,,,0,1,Maison,110,5,S,sols,,,889,3.257668,48.214166
2019-1344844,2019-02-11,000001,Vente,65500,29,,RTE DE VOULX,0325,89100,89354,Saint-Martin-du-Tertre,89,,,893540000D0753,,,,,,,,,,,,,0,1,Maison,63,3,S,sols,,,63,3.264304,48.201798
2019-1345162,2019-04-15,000002,Vente,19900,,,LES EAUX BUES,B027,89100,89354,Saint-Martin-du-Tertre,89,,,893540000B0901,,,,,,,,,,,,,0,,,,,T,terres,,,165,3.250525,48.211599
2019-1345162,2019-04-15,000002,Vente,19900,,,LES EAUX BUES,B027,89100,89354,Saint-Martin-du-Tertre,89,,,893540000B0901,,,,,,,,,,,,,0,,,,,T,terres,,,204,3.250525,48.211599
2019-1345162,2019-04-15,000002,Vente,19900,,,LES EAUX BUES,B027,89100,89354,Saint-Martin-du-Tertre,89,,,893540000B0901,,,,,,,,,,,,,0,,,,,T,terres,,,30,3.250525,48.211599
2019-1345162,2019-04-15,000002,Vente,19900,,,LES EAUX BUES,B027,89100,89354,Saint-Martin-du-Tertre,89,,,893540000B0901,,,,,,,,,,,,,0,,,,,T,terres,,,339,3.250525,48.211599
2019-1345162,2019-04-15,000002,Vente,19900,,,LES EAUX BUES,B027,89100,89354,Saint-Martin-du-Tertre,89,,,893540000B0901,,,,,,,,,,,,,0,,,,,T,terres,,,162,3.250525,48.211599
2019-1345162,2019-04-15,000002,Vente,19900,,,LES EAUX BUES,B027,89100,89354,Saint-Martin-du-Tertre,89,,,893540000B0927,,,,,,,,,,,,,0,,,,,T,terres,,,6,3.250709,48.211517
2019-1345236,2019-04-29,000001,Vente,50000,56,,RUE DES CAVES,0040,89100,89354,Saint-Martin-du-Tertre,89,,,893540000E0820,,,,,,,,,,,,,0,1,Maison,85,3,S,sols,,,227,3.25532,48.209295
2019-1345236,2019-04-29,000001,Vente,50000,,,LA GRANDE VOIE,B036,89100,89354,Saint-Martin-du-Tertre,89,,,893540000E0822,,,,,,,,,,,,,0,,,,,S,sols,,,286,3.255257,48.209205
2019-1345240,2019-05-16,000001,Vente,110000,17,,RTE DE NAILLY,0205,89100,89354,Saint-Martin-du-Tertre,89,,,893540000C0433,,,,,,,,,,,,,0,1,Maison,60,3,S,sols,,,918,3.2596,48.217435
2019-1345240,2019-05-16,000001,Vente,110000,,,LA POINTE A L AIGUILLON,B055,89100,89354,Saint-Martin-du-Tertre,89,,,893540000C0436,,,,,,,,,,,,,0,,,,,S,sols,,,135,3.259495,48.21753
2019-1345296,2019-05-06,000001,Vente,138450,5,,RUE DES LILAS,0175,89100,89354,Saint-Martin-du-Tertre,89,,,89354000ZD0137,,,,,,,,,,,,,0,1,Maison,95,4,S,sols,,,526,3.262325,48.219098
2019-1345296,2019-05-06,000001,Vente,138450,,,LES COLONNES,B022,89100,89354,Saint-Martin-du-Tertre,89,,,89354000ZD0140,,,,,,,,,,,,,0,,,,,S,sols,,,609,3.262184,48.218967
2019-1345370,2019-06-11,000001,Vente,,,,LES ROTIES,B060,89100,89354,Saint-Martin-du-Tertre,89,,,89354000ZC0284,,,,,,,,,,,,,0,,,,,S,sols,,,1006,3.249262,48.210691
2019-1345370,2019-06-11,000001,Vente,,,,LES ROTIES,B060,89100,89354,Saint-Martin-du-Tertre,89,,,89354000ZC0309,,,,,,,,,,,,,0,,,,,S,sols,,,811,3.249653,48.210939
2019-1345370,2019-06-11,000001,Vente,,,,LES ROTIES,B060,89100,89354,Saint-Martin-du-Tertre,89,,,89354000ZC0310,,,,,,,,,,,,,0,,,,,T,terres,,,6370,3.24969,48.209786
2019-1345370,2019-06-11,000001,Vente,,,,LES ROTIES,B060,89100,89354,Saint-Martin-du-Tertre,89,,,89354000ZC0311,,,,,,,,,,,,,0,,,,,S,sols,,,342,3.248884,48.210114
2019-1345377,2019-06-04,000001,Vente,243400,15,,CHE DES MARRONNIERS,0190,89100,89354,Saint-Martin-du-Tertre,89,,,893540000D1011,,,,,,,,,,,,,0,1,Maison,146,5,S,sols,,,1000,3.263373,48.204096
2019-1345377,2019-06-04,000001,Vente,243400,15,,CHE DES MARRONNIERS,0190,89100,89354,Saint-Martin-du-Tertre,89,,,893540000D1011,,,,,,,,,,,,,0,1,Maison,146,5,AG,terrains d'agrément,,,609,3.263373,48.204096
2019-1345603,2019-07-11,000001,Vente,170000,10,,RUE HENRI VINCENOT,0135,89100,89354,Saint-Martin-du-Tertre,89,,,89354000ZD0464,,,,,,,,,,,,,0,1,Maison,97,4,S,sols,,,600,3.255528,48.217052
2019-1345747,2019-07-26,000001,Vente,153500,9,,RUE DU MIDI,0195,89100,89354,Saint-Martin-du-Tertre,89,,,89354000ZD0268,,,,,,,,,,,,,0,1,Maison,82,5,S,sols,,,511,3.257838,48.217635
2019-1345777,2019-08-16,000001,Vente,1,,,LE CRUJON,B025,89100,89354,Saint-Martin-du-Tertre,89,,,893540000D0858,,,,,,,,,,,,,0,,,,,T,terres,,,179,3.255294,48.208584
2019-1345819,2019-08-29,000001,Vente,82000,51,,GR GRANDE RUE,0105,89100,89354,Saint-Martin-du-Tertre,89,,,893540000C0221,,,,,,,,,,,,,0,1,Maison,71,4,S,sols,,,285,3.25677,48.211967
2019-1345819,2019-08-29,000001,Vente,82000,324,,LE VILLAGE,B069,89100,89354,Saint-Martin-du-Tertre,89,,,893540000C0222,,,,,,,,,,,,,0,3,Dépendance,,0,S,sols,,,116,3.256711,48.211874
2019-1345904,2019-09-12,000001,Vente,3632.3,,,LES GLACIERS,B030,89100,89354,Saint-Martin-du-Tertre,89,,,89354000ZI0006,,,,,,,,,,,,,0,,,,,BT,taillis simples,,,10378,3.238641,48.204833
2019-1345925,2019-09-16,000001,Vente,,,,LE CRUJON,B025,89100,89354,Saint-Martin-du-Tertre,89,,,893540000D0670,,,,,,,,,,,,,0,,,,,T,terres,,,302,3.255204,48.208471
2019-1346013,2019-09-13,000001,Vente,132000,10,B,RUE DU CHAUDRON,0055,89100,89354,Saint-Martin-du-Tertre,89,,,893540000C0967,,,,,,,,,,,,,0,1,Maison,99,4,S,sols,,,510,3.259466,48.213509
2019-1346037,2019-09-27,000001,Vente,130000,4,,RUE DU MIDI,0195,89100,89354,Saint-Martin-du-Tertre,89,,,89354000ZD0276,,,,,,,,,,,,,0,1,Maison,84,4,S,sols,,,455,3.257963,48.217998
2019-1346043,2019-09-10,000001,Vente,223000,25,,RUE DES HAUTS GLACIERS,0130,89100,89354,Saint-Martin-du-Tertre,89,,,893540000E0911,,,,,,,,,,,,,0,1,Maison,146,4,S,sols,,,950,3.251784,48.20898
2019-1346172,2019-10-23,000001,Vente,47000,,,LA POINTE A L AIGUILLON,B055,89100,89354,Saint-Martin-du-Tertre,89,,,893540000C0568,,,,,,,,,,,,,0,,,,,T,terres,,,539,,
2019-1346172,2019-10-23,000001,Vente,47000,,,LA POINTE A L AIGUILLON,B055,89100,89354,Saint-Martin-du-Tertre,89,,,893540000C0570,,,,,,,,,,,,,0,,,,,T,terres,,,507,,
2019-1346178,2019-10-02,000001,Vente,138000,4,,CHE DES MARRONNIERS,0190,89100,89354,Saint-Martin-du-Tertre,89,,,893540000D0892,,,,,,,,,,,,,0,1,Maison,81,3,S,sols,,,1269,3.263833,48.204905
2019-1346205,2019-10-24,000001,Vente,133750,2,,RUE DES CAVES,0040,89100,89354,Saint-Martin-du-Tertre,89,,,893540000C0464,,,,,,,,,,,,,0,1,Maison,83,3,S,sols,,,275,3.263318,48.21552
2019-1346205,2019-10-24,000001,Vente,133750,2,,RUE DES CAVES,0040,89100,89354,Saint-Martin-du-Tertre,89,,,893540000C0464,,,,,,,,,,,,,0,1,Maison,83,3,J,jardins,,,590,3.263318,48.21552
2019-1346279,2019-10-24,000001,Vente,92000,5,,RUE DU CHAUDRON,0055,89100,89354,Saint-Martin-du-Tertre,89,,,893540000C0489,,,,,,,,,,,,,0,1,Maison,70,3,S,sols,,,441,3.259445,48.212702
2019-1346279,2019-10-24,000001,Vente,92000,,,LE VILLAGE,B069,89100,89354,Saint-Martin-du-Tertre,89,,,893540000C0490,,,,,,,,,,,,,0,,,,,S,sols,,,18,3.25956,48.212741
2019-1346279,2019-10-24,000001,Vente,92000,,,LE VILLAGE,B069,89100,89354,Saint-Martin-du-Tertre,89,,,893540000C0493,,,,,,,,,,,,,0,,,,,S,sols,,,65,3.259586,48.212796
2019-1346295,2019-10-24,000001,Vente,39700,,,LE VILLAGE,B069,89100,89354,Saint-Martin-du-Tertre,89,,,893540000C0864,,,,,,,,,,,,,0,,,,,S,sols,,,28,3.262291,48.214648
2019-1346295,2019-10-24,000001,Vente,39700,,,LE VILLAGE,B069,89100,89354,Saint-Martin-du-Tertre,89,,,893540000C0865,,,,,,,,,,,,,0,,,,,AG,terrains d'agrément,,,482,3.26215,48.214688
2019-1346405,2019-11-25,000001,Vente,25000,,,LES CAVES,B014,89100,89354,Saint-Martin-du-Tertre,89,,,893540000A0858,,,,,,,,,,,,,0,3,Dépendance,,0,S,sols,,,464,3.223013,48.197412
2019-1346405,2019-11-25,000001,Vente,25000,,,VERS LA CAVE,B066,89100,89354,Saint-Martin-du-Tertre,89,,,89354000ZK0074,,,,,,,,,,,,,0,,,,,T,terres,,,1717,3.223172,48.197666
2019-1346446,2019-12-11,000001,Vente,1385,,,LES EAUX BUES,B027,89100,89354,Saint-Martin-du-Tertre,89,,,893540000B0900,,,,,,,,,,,,,0,,,,,T,terres,,,277,3.253684,48.212556
2019-1346456,2019-12-04,000001,Vente,2000,,,LES HAUTS DES GLACIERS,B041,89100,89354,Saint-Martin-du-Tertre,89,,,89354000ZE0059,,,,,,,,,,,,,0,,,,,T,terres,,,9220,3.250978,48.206122
2019-1346473,2019-12-09,000002,Vente,120000,,,LES CELLIERS,B015,89100,89354,Saint-Martin-du-Tertre,89,,,89354000ZD0520,,,,,,,,,,,,,0,,,,,S,sols,,,347,3.256853,48.216556
2019-1346478,2019-12-09,000001,Vente,39000,24,,RUE DES HUGES,0140,89100,89354,Saint-Martin-du-Tertre,89,,,893540000E0973,,,,,,,,,,,,,0,1,Maison,34,2,S,sols,,,712,3.254342,48.209028
2019-1346548,2019-11-27,000001,Vente,3229,,,LES GLACIERS,B030,89100,89354,Saint-Martin-du-Tertre,89,,,893540000A0006,,,,,,,,,,,,,0,,,,,BT,taillis simples,,,34550,3.23416,48.204758
2019-1346548,2019-11-27,000001,Vente,3229,,,LES GLACIERS,B030,89100,89354,Saint-Martin-du-Tertre,89,,,893540000A0006,,,,,,,,,,,,,0,,,,,T,terres,,,8500,3.23416,48.204758
2019-1346550,2019-11-27,000001,Vente,14862,,,LES GLACIERS,B030,89100,89354,Saint-Martin-du-Tertre,89,,,89354000ZH0001,,,,,,,,,,,,,0,,,,,T,terres,,,41283,3.220187,48.204581
2019-1346570,2019-12-02,000001,Vente,168000,,,LES CARRELOTTES,B013,89100,89354,Saint-Martin-du-Tertre,89,,,893540000D0628,,,,,,,,,,,,,0,,,,,L,landes,,,350,3.257224,48.210571
2019-1346570,2019-12-02,000001,Vente,168000,43,,RUE DES CAVES,0040,89100,89354,Saint-Martin-du-Tertre,89,,,893540000D0849,,,,,,,,,,,,,0,1,Maison,140,4,S,sols,,,507,3.257047,48.210723
2019-1346570,2019-12-02,000001,Vente,168000,,,LES CARRELOTTES,B013,89100,89354,Saint-Martin-du-Tertre,89,,,893540000D0850,,,,,,,,,,,,,0,,,,,S,sols,,,83,3.256938,48.210835
