id_mutation,date_mutation,numero_disposition,nature_mutation,valeur_fonciere,adresse_numero,adresse_suffixe,adresse_nom_voie,adresse_code_voie,code_postal,code_commune,nom_commune,code_departement,ancien_code_commune,ancien_nom_commune,id_parcelle,ancien_id_parcelle,numero_volume,lot1_numero,lot1_surface_carrez,lot2_numero,lot2_surface_carrez,lot3_numero,lot3_surface_carrez,lot4_numero,lot4_surface_carrez,lot5_numero,lot5_surface_carrez,nombre_lots,code_type_local,type_local,surface_reelle_bati,nombre_pieces_principales,code_nature_culture,nature_culture,code_nature_culture_speciale,nature_culture_speciale,surface_terrain,longitude,latitude
2019-1338155,2019-01-08,000001,Vente,94079,,,LE VILLAGE,B077,89700,89417,Tissey,89,,,894170000C0200,,,,,,,,,,,,,0,,,,,S,sols,,,550,3.900697,47.852063
2019-1338155,2019-01-08,000001,Vente,94079,6,,PTR PETITE RUE DE COLLAN,0150,89700,89417,Tissey,89,,,894170000C0201,,,,,,,,,,,,,0,4,Local industriel. commercial ou assimilé,400,0,S,sols,,,1682,3.900406,47.852024
2019-1338155,2019-01-08,000001,Vente,94079,62,,LE VILLAGE,B077,89700,89417,Tissey,89,,,894170000C0202,,,,,,,,,,,,,0,1,Maison,115,6,S,sols,,,558,3.900375,47.851917
2019-1338155,2019-01-08,000001,Vente,94079,,,LE VILLAGE,B077,89700,89417,Tissey,89,,,894170000C0204,,,,,,,,,,,,,0,,,,,T,terres,,,915,3.899885,47.852075
2019-1338155,2019-01-08,000001,Vente,94079,,,LE VILLAGE,B077,89700,89417,Tissey,89,,,894170000C0231,,,,,,,,,,,,,0,,,,,J,jardins,,,110,3.901196,47.85181
2019-1338155,2019-01-08,000001,Vente,94079,,,LE VILLAGE,B077,89700,89417,Tissey,89,,,894170000C0233,,,,,,,,,,,,,0,,,,,J,jardins,,,66,3.901309,47.851813
2019-1338155,2019-01-08,000001,Vente,94079,,,LE VILLAGE,B077,89700,89417,Tissey,89,,,894170000C0477,,,,,,,,,,,,,0,,,,,S,sols,,,200,3.900606,47.851721
2019-1338155,2019-01-08,000001,Vente,94079,5001,F,RLE DU GROS VERROU,0075,89700,89417,Tissey,89,,,894170000C0549,,,,,,,,,,,,,0,3,Dépendance,,0,S,sols,,,392,3.900232,47.851885
2019-1338155,2019-01-08,000001,Vente,94079,,,LES GRUERES,B035,89700,89417,Tissey,89,,,89417000ZK0004,,,,,,,,,,,,,0,,,,,T,terres,,,5145,3.90253,47.855112
2019-1338155,2019-01-08,000001,Vente,94079,,,LES GRUERES,B035,89700,89417,Tissey,89,,,89417000ZK0004,,,,,,,,,,,,,0,,,,,T,terres,,,5145,3.90253,47.855112
2019-1338155,2019-01-08,000001,Vente,94079,,,LES CRAIS,B026,89700,89417,Tissey,89,,,89417000ZK0034,,,,,,,,,,,,,0,,,,,VE,vergers,,,950,3.904017,47.8475
2019-1339818,2019-07-27,000001,Vente,70000,4,,PTR PETITE RUE DE COLLAN,0150,89700,89417,Tissey,89,,,894170000C0197,,,,,,,,,,,,,0,1,Maison,77,3,S,sols,,,575,3.901128,47.852031
2019-1339818,2019-07-27,000001,Vente,70000,,,LE VILLAGE,B077,89700,89417,Tissey,89,,,894170000C0199,,,,,,,,,,,,,0,,,,,T,terres,,,2790,3.900854,47.852286
2019-1339935,2019-09-07,000001,Vente,2000,,,LE VILLAGE,B077,89700,89417,Tissey,89,,,894170000C0437,,,,,,,,,,,,,0,,,,,T,terres,,,385,3.903017,47.851439
2019-1339935,2019-09-07,000001,Vente,2000,,,LE VILLAGE,B077,89700,89417,Tissey,89,,,894170000C0453,,,,,,,,,,,,,0,,,,,S,sols,,,232,3.902715,47.851406
