id_mutation,date_mutation,numero_disposition,nature_mutation,valeur_fonciere,adresse_numero,adresse_suffixe,adresse_nom_voie,adresse_code_voie,code_postal,code_commune,nom_commune,code_departement,ancien_code_commune,ancien_nom_commune,id_parcelle,ancien_id_parcelle,numero_volume,lot1_numero,lot1_surface_carrez,lot2_numero,lot2_surface_carrez,lot3_numero,lot3_surface_carrez,lot4_numero,lot4_surface_carrez,lot5_numero,lot5_surface_carrez,nombre_lots,code_type_local,type_local,surface_reelle_bati,nombre_pieces_principales,code_nature_culture,nature_culture,code_nature_culture_speciale,nature_culture_speciale,surface_terrain,longitude,latitude
2019-1346756,2019-01-11,000001,Vente,247250,21,,RUE PRINCIPALE,0063,90100,90030,Croix,90,,,900300000D0317,,,,,,,,,,,,,0,1,Maison,183,7,S,sols,,,744,6.954538,47.446375
2019-1347127,2019-03-13,000001,Vente,2000,,,DERRIERE LES BOIS,B033,90100,90030,Croix,90,,,900300000C0053,,,,,,,,,,,,,0,,,,,BT,taillis simples,,,2360,6.9416,47.444175
2019-1347127,2019-03-13,000001,Vente,2000,,,SOUS LE CHAUFFOUR,B072,90100,90030,Croix,90,,,900300000C0550,,,,,,,,,,,,,0,,,,,T,terres,,,1395,6.94211,47.444271
2019-1347147,2019-03-22,000001,Vente,2800,,,LA PLANCHE AU MOINE,B061,90100,90030,Croix,90,,,900300000A0054,,,,,,,,,,,,,0,,,,,BT,taillis simples,,,1770,6.962605,47.448973
2019-1347147,2019-03-22,000001,Vente,2800,,,ROVESAIRES,B070,90100,90030,Croix,90,,,900300000A0082,,,,,,,,,,,,,0,,,,,BT,taillis simples,,,2132,6.960508,47.450545
2019-1347147,2019-03-22,000001,Vente,2800,,,ROVESAIRES,B070,90100,90030,Croix,90,,,900300000A0090,,,,,,,,,,,,,0,,,,,BT,taillis simples,,,2150,6.96032,47.450154
2019-1347212,2019-02-27,000001,Vente,70000,,,DERRIERE LES MURS,B035,90100,90030,Croix,90,,,90030000ZC0062,,,,,,,,,,,,,0,,,,,VE,vergers,,,1157,6.953162,47.442911
2019-1347212,2019-02-27,000001,Vente,70000,,,DERRIERE LES MURS,B035,90100,90030,Croix,90,,,90030000ZC0065,,,,,,,,,,,,,0,,,,,T,terres,,,384,6.953445,47.442989
2019-1347686,2019-06-08,000002,Vente,60000,,,CHEZ PRINAT,B016,90100,90030,Croix,90,,,90030000ZB0109,,,,,,,,,,,,,0,,,,,AB,terrains a bâtir,,,1017,6.95934,47.443847
2019-1347686,2019-06-08,000002,Vente,60000,,,CHEZ PRINAT,B016,90100,90030,Croix,90,,,90030000ZB0141,,,,,,,,,,,,,0,,,,,T,terres,,,391,6.959696,47.4441
2019-1347687,2019-05-20,000001,Vente,357000,10,,RUE DE VILLARS LE SEC,0095,90100,90030,Croix,90,,,900300000D0090,,,,,,,,,,,,,0,1,Maison,199,5,VE,vergers,,,745,6.95706,47.443778
2019-1347687,2019-05-20,000001,Vente,357000,10,,RUE DE VILLARS LE SEC,0095,90100,90030,Croix,90,,,900300000D0090,,,,,,,,,,,,,0,1,Maison,199,5,S,sols,,,1000,6.95706,47.443778
2019-1347687,2019-05-20,000001,Vente,357000,,,GROS CHAMPS,B050,90100,90030,Croix,90,,,90030000ZB0021,,,,,,,,,,,,,0,,,,,VE,vergers,,,1720,6.95738,47.443096
2019-1347999,2019-07-24,000001,Vente,20081.25,,,HAUT DES AIRS,B052,90100,90030,Croix,90,,,90030000ZB0047,,,,,,,,,,,,,0,,,,,T,terres,,,21347,6.964837,47.440714
2019-1347999,2019-07-24,000001,Vente,20081.25,,,HAUT DES AIRS,B052,90100,90030,Croix,90,,,90030000ZB0047,,,,,,,,,,,,,0,,,,,T,terres,,,64043,6.964837,47.440714
2019-1348345,2019-08-30,000001,Vente,75000,,,LE VILLAGE,B079,90100,90030,Croix,90,,,900300000D0434,,,,,,,,,,,,,0,,,,,S,sols,,,1049,6.956013,47.444492
