id_mutation,date_mutation,numero_disposition,nature_mutation,valeur_fonciere,adresse_numero,adresse_suffixe,adresse_nom_voie,adresse_code_voie,code_postal,code_commune,nom_commune,code_departement,ancien_code_commune,ancien_nom_commune,id_parcelle,ancien_id_parcelle,numero_volume,lot1_numero,lot1_surface_carrez,lot2_numero,lot2_surface_carrez,lot3_numero,lot3_surface_carrez,lot4_numero,lot4_surface_carrez,lot5_numero,lot5_surface_carrez,nombre_lots,code_type_local,type_local,surface_reelle_bati,nombre_pieces_principales,code_nature_culture,nature_culture,code_nature_culture_speciale,nature_culture_speciale,surface_terrain,longitude,latitude
2019-1357458,2019-01-08,000001,Vente,340000,96,,RTE DE VERSAILLES,0500,91160,91136,Champlan,91,,,91136000AI0107,,,,,,,,,,,,,0,1,Maison,150,5,S,sols,,,500,2.281935,48.703835
2019-1357458,2019-01-08,000001,Vente,340000,96,,RTE DE VERSAILLES,0500,91160,91136,Champlan,91,,,91136000AI0107,,,,,,,,,,,,,0,1,Maison,150,5,AG,terrains d'agrément,PARC,Parc,901,2.281935,48.703835
2019-1357523,2019-01-17,000001,Vente,654000,14,,RUE DE LA MAIRIE,0300,91160,91136,Champlan,91,,,91136000AO0131,,,,,,,,,,,,,0,1,Maison,197,6,S,sols,,,500,2.27282,48.709312
2019-1357523,2019-01-17,000001,Vente,654000,14,,RUE DE LA MAIRIE,0300,91160,91136,Champlan,91,,,91136000AO0131,,,,,,,,,,,,,0,1,Maison,197,6,AG,terrains d'agrément,PARC,Parc,1018,2.27282,48.709312
2019-1357782,2019-02-06,000001,Vente,314000,6,,RUE DE LA CERISERAIE,0155,91160,91136,Champlan,91,,,91136000AN0107,,,,,,,,,,,,,0,1,Maison,90,4,S,sols,,,300,2.263476,48.70893
2019-1357782,2019-02-06,000001,Vente,314000,6,,RUE DE LA CERISERAIE,0155,91160,91136,Champlan,91,,,91136000AN0107,,,,,,,,,,,,,0,4,Local industriel. commercial ou assimilé,,0,S,sols,,,300,2.263476,48.70893
2019-1357827,2019-01-24,000001,Vente,1000000,26,,RUE DE PARIS,0420,91160,91136,Champlan,91,,,911360000C0545,,,,,,,,,,,,,0,4,Local industriel. commercial ou assimilé,682,0,J,jardins,MARAM,Jardin maraîcher aménagé,3249,2.281487,48.71133
2019-1357827,2019-01-24,000001,Vente,1000000,26,,RUE DE PARIS,0420,91160,91136,Champlan,91,,,911360000C0545,,,,,,,,,,,,,0,4,Local industriel. commercial ou assimilé,682,0,J,jardins,SERRE,Serre,1084,2.281487,48.71133
2019-1357827,2019-01-24,000001,Vente,1000000,26,,RUE DE PARIS,0420,91160,91136,Champlan,91,,,911360000C0545,,,,,,,,,,,,,0,4,Local industriel. commercial ou assimilé,682,0,S,sols,,,1544,2.281487,48.71133
2019-1357827,2019-01-24,000001,Vente,1000000,,,VC LE CHEMIN DE PARIS,0120,91160,91136,Champlan,91,,,911360000C0562,,,,,,,,,,,,,0,,,,,S,sols,,,1,2.280745,48.711158
2019-1357882,2019-02-14,000001,Vente,142000,13,,VC LE CHEMIN DE CHILLY,0080,91160,91136,Champlan,91,,,91136000AK0089,,,26,,27,,28,,47,,9,,5,4,Local industriel. commercial ou assimilé,138,0,,,,,,2.278195,48.708351
2019-1358317,2019-02-22,000001,Vente,201000,4,,CHE DE L'ECHAUDE,0190,91160,91136,Champlan,91,,,91136000AK0037,,,,,,,,,,,,,0,1,Maison,79,5,S,sols,,,506,2.275138,48.710052
2019-1358343,2019-03-11,000001,Vente,195540,167,,RTE DE VERSAILLES,0500,91160,91136,Champlan,91,,,91136000AM0003,,,8,55.46,9,,,,,,,,2,2,Appartement,25,2,,,,,,2.270388,48.7086
2019-1358429,2019-03-01,000001,Vente,279575,97,B,RTE DE VERSAILLES,0500,91160,91136,Champlan,91,,,91136000AI0190,,,,,,,,,,,,,0,1,Maison,123,6,S,sols,,,585,2.281643,48.703073
2019-1358547,2019-03-01,000001,Vente,247000,8,B,RUE DE LA DIVISION LECLERC,0180,91160,91136,Champlan,91,,,91136000AL0034,,,,,,,,,,,,,0,4,Local industriel. commercial ou assimilé,50,0,S,sols,,,185,2.273824,48.708136
2019-1358547,2019-03-01,000001,Vente,247000,8,B,RUE DE LA DIVISION LECLERC,0180,91160,91136,Champlan,91,,,91136000AL0034,,,,,,,,,,,,,0,1,Maison,127,3,S,sols,,,185,2.273824,48.708136
2019-1358663,2019-03-11,000001,Vente,116560,4,,RUE DE LA MAIRIE,0300,91160,91136,Champlan,91,,,91136000AO0124,,,6,43.24,,,,,,,,,1,4,Local industriel. commercial ou assimilé,50,0,,,,,,2.273795,48.708853
2019-1358825,2019-04-12,000001,Vente,295000,47,,RTE DE VERSAILLES,0500,91160,91136,Champlan,91,,,91136000AE0194,,,,,,,,,,,,,0,1,Maison,67,3,S,sols,,,502,2.286169,48.701079
2019-1358830,2019-04-09,000001,Vente,300000,14,,RTE DE VERSAILLES,0500,91160,91136,Champlan,91,,,91136000AE0142,,,,,,,,,,,,,0,1,Maison,100,6,S,sols,,,399,2.290874,48.699386
2019-1358832,2019-03-18,000001,Vente,270000,6,,CHE DE LA BUTTE,0040,91160,91136,Champlan,91,,,91136000AO0221,,,,,,,,,,,,,0,1,Maison,70,4,S,sols,,,307,2.266809,48.711338
2019-1359630,2019-05-15,000001,Vente,312000,33,,RUE JEAN JAURES,0260,91160,91136,Champlan,91,,,91136000AE0119,,,,,,,,,,,,,0,1,Maison,153,6,S,sols,,,426,2.288635,48.701242
2019-1359764,2019-05-16,000001,Vente,332000,22,,RUE DES ACACIAS,0010,91160,91136,Champlan,91,,,91136000AO0037,,,,,,,,,,,,,0,1,Maison,58,3,S,sols,,,980,2.265306,48.713032
2019-1360488,2019-06-26,000001,Vente,163500,25,,RUE JEAN JAURES,0260,91160,91136,Champlan,91,,,91136000AE0129,,,,,,,,,,,,,0,1,Maison,60,3,S,sols,,,107,2.289807,48.701004
2019-1360488,2019-06-26,000001,Vente,163500,25,B,RUE JEAN JAURES,0260,91160,91136,Champlan,91,,,91136000AE0130,,,,,,,,,,,,,0,,,,,S,sols,,,29,2.289872,48.701077
2019-1360593,2019-06-24,000001,Vente,20302,,,LA ROUE,B036,91160,91136,Champlan,91,,,91136000AL0154,,,,,,,,,,,,,0,,,,,T,terres,,,542,2.277125,48.706372
2019-1360593,2019-06-24,000001,Vente,20302,,,LE DESSUS DU MOULIN,B043,91160,91136,Champlan,91,,,91136000AN0098,,,,,,,,,,,,,0,,,,,T,terres,,,4127,2.262986,48.708582
2019-1360596,2019-06-24,000001,Vente,5100,,,LES DONJONS,B044,91160,91136,Champlan,91,,,91136000AN0290,,,,,,,,,,,,,0,,,,,J,jardins,POTAG,Jardin potager,340,2.269141,48.707732
2019-1360606,2019-07-01,000001,Vente,278000,14,B,RUE JEAN JAURES,0260,91160,91136,Champlan,91,,,91136000AE0032,,,,,,,,,,,,,0,1,Maison,78,4,S,sols,,,468,2.291052,48.700967
2019-1360809,2019-07-12,000001,Vente,195000,9,,VC LE CHEMIN DE CHILLY,0080,91160,91136,Champlan,91,,,91136000AK0088,,,10,,11,,12,,47,128.1,9,,5,4,Local industriel. commercial ou assimilé,128,0,,,,,,2.277667,48.70845
2019-1360821,2019-07-22,000001,Vente,529650,37,,RUE DE PARIS,0420,91160,91136,Champlan,91,,,91136000AK0024,,,,,,,,,,,,,0,1,Maison,256,7,AG,terrains d'agrément,PARC,Parc,2994,2.277419,48.710164
2019-1360821,2019-07-22,000001,Vente,529650,37,,RUE DE PARIS,0420,91160,91136,Champlan,91,,,91136000AK0024,,,,,,,,,,,,,0,1,Maison,256,7,S,sols,,,500,2.277419,48.710164
2019-1360868,2019-07-22,000001,Vente,270000,17,B,RUE DE PARIS,0420,91160,91136,Champlan,91,,,91136000AK0047,,,,,,,,,,,,,0,1,Maison,59,3,S,sols,,,653,2.275584,48.709165
2019-1361504,2019-08-02,000001,Vente,467850,14,,CR 6 DU MOULIN PAR LE BAS,0374,91160,91136,Champlan,91,,,91136000AN0350,,,,,,,,,,,,,0,1,Maison,128,5,S,sols,,,500,2.265183,48.705239
2019-1361504,2019-08-02,000001,Vente,467850,14,,CR 6 DU MOULIN PAR LE BAS,0374,91160,91136,Champlan,91,,,91136000AN0350,,,,,,,,,,,,,0,1,Maison,128,5,AG,terrains d'agrément,PARC,Parc,2441,2.265183,48.705239
2019-1361618,2019-09-05,000001,Vente,430000,23,,RUE DU PARC DES SPORTS,0415,91160,91136,Champlan,91,,,91136000AO0112,,,,,,,,,,,,,0,1,Maison,140,7,S,sols,,,501,2.274377,48.711311
2019-1361853,2019-09-10,000001,Vente,225000,27,,RTE DE VILLEBON,0526,91160,91136,Champlan,91,,,91136000AN0089,,,,,,,,,,,,,0,1,Maison,37,2,S,sols,,,311,2.261018,48.70787
2019-1361916,2019-09-17,000001,Vente,132200,167,,RTE DE VERSAILLES,0500,91160,91136,Champlan,91,,,91136000AM0003,,,2,45.02,7,,,,,,,,2,2,Appartement,25,1,,,,,,2.270388,48.7086
2019-1362027,2019-09-17,000001,Vente,180000,33,,RUE DE LA DIVISION LECLERC,0180,91160,91136,Champlan,91,,,91136000AL0087,,,1,,,,,,,,,,1,1,Maison,110,4,,,,,,2.274306,48.70718
2019-1362027,2019-09-17,000001,Vente,180000,33,,RUE DE LA DIVISION LECLERC,0180,91160,91136,Champlan,91,,,91136000AL0087,,,5,,,,,,,,,,1,3,Dépendance,,0,,,,,,2.274306,48.70718
2019-1362027,2019-09-17,000001,Vente,180000,33,,RUE DE LA DIVISION LECLERC,0180,91160,91136,Champlan,91,,,91136000AL0087,,,8,,,,,,,,,,1,4,Local industriel. commercial ou assimilé,50,0,,,,,,2.274306,48.70718
2019-1362168,2019-09-23,000001,Vente,5145,,,LES DONJONS,B044,91160,91136,Champlan,91,,,91136000AN0291,,,,,,,,,,,,,0,,,,,J,jardins,POTAG,Jardin potager,343,2.269063,48.707761
2019-1362507,2019-10-03,000001,Vente,364500,16,,RTE DE VILLEBON,0526,91160,91136,Champlan,91,,,91136000AN0023,,,,,,,,,,,,,0,1,Maison,119,5,S,sols,,,993,2.265398,48.710088
2019-1362532,2019-09-26,000001,Vente,337000,10,,RUE DU MOULIN,0375,91160,91136,Champlan,91,,,91136000AN0190,,,1,138.42,,,,,,,,,1,1,Maison,130,6,,,,,,2.268678,48.708733
2019-1362566,2019-10-03,000001,Vente,275000,171,,RTE DE VERSAILLES,0500,91160,91136,Champlan,91,,,91136000AN0164,,,,,,,,,,,,,0,1,Maison,95,7,S,sols,,,365,2.268801,48.709261
2019-1362706,2019-10-03,000001,Vente,392000,38,,RUE DE LA CERISERAIE,0155,91160,91136,Champlan,91,,,91136000AN0156,,,,,,,,,,,,,0,1,Maison,116,5,S,sols,,,451,2.263825,48.709722
2019-1362710,2019-10-21,000001,Vente,262000,23,,RTE DE VERSAILLES,0500,91160,91136,Champlan,91,,,91136000AE0176,,,,,,,,,,,,,0,1,Maison,94,5,S,sols,,,489,2.288184,48.700066
2019-1362773,2019-10-04,000001,Vente,178000,,,RUE DU TROU MAHET,0480,91160,91136,Champlan,91,,,91136000AM0141,,,,,,,,,,,,,0,,,,,S,sols,,,736,2.270824,48.7078
2019-1362773,2019-10-04,000001,Vente,178000,28,,RUE DU TROU MAHET,0480,91160,91136,Champlan,91,,,91136000AM0148,,,,,,,,,,,,,0,1,Maison,24,1,S,sols,,,36,2.27092,48.707919
2019-1362836,2019-10-03,000001,Vente,354000,29,,RTE DE VILLEBON,0526,91160,91136,Champlan,91,,,91136000AN0088,,,,,,,,,,,,,0,1,Maison,87,5,S,sols,,,626,2.260863,48.707669
2019-1362836,2019-10-03,000001,Vente,354000,29,,RTE DE VILLEBON,0526,91160,91136,Champlan,91,,,91136000AN0088,,,,,,,,,,,,,0,4,Local industriel. commercial ou assimilé,20,0,S,sols,,,626,2.260863,48.707669
2019-1362902,2019-10-10,000001,Vente,180400,22,,RUE DE SAULX,0460,91160,91136,Champlan,91,,,91136000AM0168,,,,,,,,,,,,,0,1,Maison,35,2,S,sols,,,104,2.272068,48.705535
2019-1362902,2019-10-10,000001,Vente,180400,22,,RUE DE SAULX,0460,91160,91136,Champlan,91,,,91136000AM0168,,,,,,,,,,,,,0,1,Maison,92,4,S,sols,,,104,2.272068,48.705535
2019-1363009,2019-11-05,000001,Vente,140000,11,,AV DE LA GARE,0220,91160,91136,Champlan,91,,,91136000AE0022,,,38,,,,,,,,,,1,2,Appartement,68,4,,,,,,2.291945,48.700557
2019-1363009,2019-11-05,000001,Vente,140000,11,,AV DE LA GARE,0220,91160,91136,Champlan,91,,,91136000AE0022,,,59,55.24,,,,,,,,,1,2,Appartement,56,3,,,,,,2.291945,48.700557
2019-1363009,2019-11-05,000001,Vente,140000,11,,AV DE LA GARE,0220,91160,91136,Champlan,91,,,91136000AE0022,,,16,,,,,,,,,,1,3,Dépendance,,0,,,,,,2.291945,48.700557
2019-1363186,2019-10-25,000001,Vente,347000,14,,RUE DE LA CERISERAIE,0155,91160,91136,Champlan,91,,,91136000AN0111,,,,,,,,,,,,,0,1,Maison,102,5,S,sols,,,310,2.264133,48.708748
2019-1363364,2019-11-15,000001,Vente,7353.15,,,L ECHAUDE,B014,91160,91136,Champlan,91,,,911360000B0177,,,,,,,,,,,,,0,,,,,T,terres,,,2209,2.27713,48.714677
2019-1363421,2019-11-08,000001,Vente,138950,146,B,RTE DE VERSAILLES,0500,91160,91136,Champlan,91,,,91136000AL0066,,,2,37.38,,,,,,,,,1,2,Appartement,37,1,,,,,,2.272971,48.706947
2019-1363533,2019-12-04,000001,Vente,150000,11,,AV DE LA GARE,0220,91160,91136,Champlan,91,,,91136000AE0022,,,44,,53,67.27,,,,,,,2,2,Appartement,68,4,,,,,,2.291945,48.700557
2019-1363533,2019-12-04,000001,Vente,150000,11,,AV DE LA GARE,0220,91160,91136,Champlan,91,,,91136000AE0022,,,1,,,,,,,,,,1,3,Dépendance,,0,,,,,,2.291945,48.700557
2019-1363758,2019-12-05,000001,Vente,1100000,14,,RUE DES CLOTAIS,0165,91160,91136,Champlan,91,,,91136000AE0005,,,,,,,,,,,,,0,4,Local industriel. commercial ou assimilé,2151,0,S,sols,,,3285,2.288521,48.703312
2019-1363933,2019-12-20,000001,Vente,2050000,9,,RUE DE L'ORME SAINT GERMAIN,0410,91160,91136,Champlan,91,,,91136000AK0098,,,,,,,,,,,,,0,4,Local industriel. commercial ou assimilé,658,0,S,sols,,,5173,2.279286,48.708383
2019-1363933,2019-12-20,000001,Vente,2050000,9,,RUE DE L'ORME SAINT GERMAIN,0410,91160,91136,Champlan,91,,,91136000AK0098,,,,,,,,,,,,,0,4,Local industriel. commercial ou assimilé,3026,0,S,sols,,,5173,2.279286,48.708383
