id_mutation,date_mutation,numero_disposition,nature_mutation,valeur_fonciere,adresse_numero,adresse_suffixe,adresse_nom_voie,adresse_code_voie,code_postal,code_commune,nom_commune,code_departement,ancien_code_commune,ancien_nom_commune,id_parcelle,ancien_id_parcelle,numero_volume,lot1_numero,lot1_surface_carrez,lot2_numero,lot2_surface_carrez,lot3_numero,lot3_surface_carrez,lot4_numero,lot4_surface_carrez,lot5_numero,lot5_surface_carrez,nombre_lots,code_type_local,type_local,surface_reelle_bati,nombre_pieces_principales,code_nature_culture,nature_culture,code_nature_culture_speciale,nature_culture_speciale,surface_terrain,longitude,latitude
2019-1357451,2019-01-07,000001,Vente,150000,281,,RUE DE LA COULEE VERTE,0410,91700,91235,Fleury-Mérogis,91,,,91235000AE0243,,,5035,,,,,,,,,,1,3,Dépendance,,0,,,,,,2.357144,48.640241
2019-1357451,2019-01-07,000001,Vente,150000,341,,RUE DE LA COULEE VERTE,0410,91700,91235,Fleury-Mérogis,91,,,91235000AE0243,,,5181,58.83,,,,,,,,,1,2,Appartement,58,3,,,,,,2.357144,48.640241
2019-1357601,2019-01-11,000001,Vente,133000,55,,RUE HANNAH ARENDT,0810,91700,91235,Fleury-Mérogis,91,,,91235000AE0188,,,237,,,,,,,,,,1,3,Dépendance,,0,,,,,,2.35824,48.641592
2019-1357601,2019-01-11,000001,Vente,133000,66,,RUE ANAIS NIN,0056,91700,91235,Fleury-Mérogis,91,,,91235000AE0188,,,6,41,,,,,,,,,1,2,Appartement,40,2,,,,,,2.35824,48.641592
2019-1357655,2019-01-16,000001,Vente,127000,397,,RUE MARCHAND ET FERAOUN,1470,91700,91235,Fleury-Mérogis,91,,,91235000AE0240,,,158,42.34,,,,,,,,,1,2,Appartement,41,2,,,,,,2.357233,48.641118
2019-1357655,2019-01-16,000001,Vente,127000,353,,RUE MARCHAND ET FERAOUN,1470,91700,91235,Fleury-Mérogis,91,,,91235000AE0240,,,420,,,,,,,,,,1,3,Dépendance,,0,,,,,,2.357233,48.641118
2019-1357675,2019-01-23,000001,Vente,3400,281,,RUE DE LA COULEE VERTE,0410,91700,91235,Fleury-Mérogis,91,,,91235000AE0243,,,314,,,,,,,,,,1,3,Dépendance,,0,,,,,,2.357144,48.640241
2019-1357690,2019-01-16,000001,Vente,275000,16,,RUE DE LA GARENNE,0665,91700,91235,Fleury-Mérogis,91,,,91235000AM0062,,,,,,,,,,,,,0,1,Maison,90,4,S,sols,,,501,2.36453,48.629376
2019-1357881,2019-01-28,000001,Vente,171000,12,,RUE DES PETITS CHAMPS,1800,91700,91235,Fleury-Mérogis,91,,,91235000AM0155,,,,,,,,,,,,,0,3,Dépendance,,0,S,sols,,,854,2.363749,48.630533
2019-1358330,2019-02-27,000001,Vente en l'état futur d'achèvement,142578,89,,RUE HANNAH ARENDT,0810,91700,91235,Fleury-Mérogis,91,,,91235000AE0187,,,262,,,,,,,,,,1,3,Dépendance,,0,,,,,,2.35694,48.642227
2019-1358330,2019-02-27,000001,Vente en l'état futur d'achèvement,142578,101,,RUE HANNAH ARENDT,0810,91700,91235,Fleury-Mérogis,91,,,91235000AE0187,,,112,,,,,,,,,,1,2,Appartement,55,3,,,,,,2.35694,48.642227
2019-1358341,2019-02-27,000001,Vente,252200,2,,ALL TOUSSAINT LOUVERTURE,2560,91700,91235,Fleury-Mérogis,91,,,91235000AI0124,,,,,,,,,,,,,0,1,Maison,79,4,S,sols,,,200,,
2019-1358341,2019-02-27,000001,Vente,252200,,,ALL TOUSSAINT LOUVERTURE,2560,91700,91235,Fleury-Mérogis,91,,,91235000AI0159,,,,,,,,,,,,,0,,,,,S,sols,,,17,2.36304,48.63559
2019-1358637,2019-03-19,000001,Vente,297000,4,,RUE ALBERT CAMUS,0040,91700,91235,Fleury-Mérogis,91,,,91235000AD0122,,,,,,,,,,,,,0,1,Maison,114,6,S,sols,,,483,2.359325,48.643962
2019-1358760,2019-04-01,000001,Vente,143163,29,,RUE NELSON MANDELA,1690,91700,91235,Fleury-Mérogis,91,,,91235000AE0100,,,,,,,,,,,,,0,1,Maison,89,5,S,sols,,,235,2.358815,48.64288
2019-1358793,2019-03-29,000001,Vente,1900000,27,,RUE EDOUARD AUBERT,0500,91700,91235,Fleury-Mérogis,91,,,91235000AN0021,,,,,,,,,,,,,0,4,Local industriel. commercial ou assimilé,1785,0,S,sols,,,6217,2.371296,48.622099
2019-1359092,2019-04-19,000001,Vente,167500,355,,RUE ANAIS NIN,0056,91700,91235,Fleury-Mérogis,91,,,91235000AE0189,,,751,,,,,,,,,,1,3,Dépendance,,0,,,,,,2.358176,48.642356
2019-1359092,2019-04-19,000001,Vente,167500,521,,RUE DE LA COULEE VERTE,0410,91700,91235,Fleury-Mérogis,91,,,91235000AE0189,,,2,56.81,,,,,,,,,1,2,Appartement,56,3,,,,,,2.358176,48.642356
2019-1359145,2019-04-15,000001,Vente,232000,179,,RUE DE LA COULEE VERTE,0410,91700,91235,Fleury-Mérogis,91,,,91235000AE0252,,,1013,,,,,,,,,,1,3,Dépendance,,0,,,,,,2.357242,48.639548
2019-1359145,2019-04-15,000001,Vente,232000,179,,RUE DE LA COULEE VERTE,0410,91700,91235,Fleury-Mérogis,91,,,91235000AE0252,,,501,,,,,,,,,,1,1,Maison,74,4,,,,,,2.357242,48.639548
2019-1359145,2019-04-15,000001,Vente,232000,179,,RUE DE LA COULEE VERTE,0410,91700,91235,Fleury-Mérogis,91,,,91235000AE0252,,,1012,,,,,,,,,,1,3,Dépendance,,0,,,,,,2.357242,48.639548
2019-1359180,2019-04-19,000001,Vente,155000,179,,RUE DE LA COULEE VERTE,0410,91700,91235,Fleury-Mérogis,91,,,91235000AE0252,,,1048,,,,,,,,,,1,3,Dépendance,,0,,,,,,2.357242,48.639548
2019-1359180,2019-04-19,000001,Vente,155000,201,,RUE DE LA COULEE VERTE,0410,91700,91235,Fleury-Mérogis,91,,,91235000AE0252,,,229,,,,,,,,,,1,2,Appartement,62,3,,,,,,2.357242,48.639548
2019-1359180,2019-04-19,000001,Vente,155000,179,,RUE DE LA COULEE VERTE,0410,91700,91235,Fleury-Mérogis,91,,,91235000AE0252,,,1047,,,,,,,,,,1,3,Dépendance,,0,,,,,,2.357242,48.639548
2019-1359270,2019-04-18,000001,Vente,373110,1,,RUE DU CHENE A CHAMPAGNE,0360,91700,91235,Fleury-Mérogis,91,,,91235000AD0199,,,,,,,,,,,,,0,4,Local industriel. commercial ou assimilé,712,0,S,sols,,,1456,2.362258,48.642504
2019-1359348,2019-05-07,000001,Vente,125000,200,,RUE MARCHAND ET FERAOUN,1470,91700,91235,Fleury-Mérogis,91,,,91235000AE0235,,,105,40.5,157,,,,,,,,2,2,Appartement,40,2,,,,,,2.359838,48.641084
2019-1359348,2019-05-07,000001,Vente,125000,9001,,RUE MARC CHAGALL,1370,91700,91235,Fleury-Mérogis,91,,,91235000AE0235,,,320,,,,,,,,,,1,3,Dépendance,,0,,,,,,2.359838,48.641084
2019-1359382,2019-05-10,000001,Vente,82026,55,,RUE HANNAH ARENDT,0810,91700,91235,Fleury-Mérogis,91,,,91235000AE0188,,,243,,,,,,,,,,1,3,Dépendance,,0,,,,,,2.35824,48.641592
2019-1359382,2019-05-10,000001,Vente,82026,55,,RUE HANNAH ARENDT,0810,91700,91235,Fleury-Mérogis,91,,,91235000AE0188,,,124,,,,,,,,,,1,2,Appartement,32,1,,,,,,2.35824,48.641592
2019-1359546,2019-05-07,000001,Vente,157000,355,,RUE ANAIS NIN,0056,91700,91235,Fleury-Mérogis,91,,,91235000AE0189,,,707,,,,,,,,,,1,3,Dépendance,,0,,,,,,2.358176,48.642356
2019-1359546,2019-05-07,000001,Vente,157000,521,,RUE DE LA COULEE VERTE,0410,91700,91235,Fleury-Mérogis,91,,,91235000AE0189,,,24,56.73,,,,,,,,,1,2,Appartement,57,3,,,,,,2.358176,48.642356
2019-1359612,2019-05-10,000001,Vente,150000,34,,RUE NELSON MANDELA,1690,91700,91235,Fleury-Mérogis,91,,,91235000AD0244,,,,,,,,,,,,,0,,,,,AB,terrains a bâtir,,,309,2.358499,48.643435
2019-1359822,2019-05-29,000001,Vente,170000,281,,RUE DE LA COULEE VERTE,0410,91700,91235,Fleury-Mérogis,91,,,91235000AE0243,,,5122,66.26,,,,,,,,,1,2,Appartement,67,4,,,,,,2.357144,48.640241
2019-1359822,2019-05-29,000001,Vente,170000,281,,RUE DE LA COULEE VERTE,0410,91700,91235,Fleury-Mérogis,91,,,91235000AE0243,,,5072,,,,,,,,,,1,3,Dépendance,,0,,,,,,2.357144,48.640241
2019-1360002,2019-06-13,000001,Vente,132158,41,,RUE NELSON MANDELA,1690,91700,91235,Fleury-Mérogis,91,,,91235000AE0094,,,,,,,,,,,,,0,1,Maison,78,4,S,sols,,,211,2.358203,48.643113
2019-1360131,2019-06-21,000001,Vente,205000,179,,RUE DE LA COULEE VERTE,0410,91700,91235,Fleury-Mérogis,91,,,91235000AE0252,,,1109,,,,,,,,,,1,3,Dépendance,,0,,,,,,2.357242,48.639548
2019-1360131,2019-06-21,000001,Vente,205000,201,,RUE DE LA COULEE VERTE,0410,91700,91235,Fleury-Mérogis,91,,,91235000AE0252,,,239,72.68,,,,,,,,,1,2,Appartement,72,4,,,,,,2.357242,48.639548
2019-1360131,2019-06-21,000001,Vente,205000,179,,RUE DE LA COULEE VERTE,0410,91700,91235,Fleury-Mérogis,91,,,91235000AE0252,,,1110,,,,,,,,,,1,3,Dépendance,,0,,,,,,2.357242,48.639548
2019-1360204,2019-06-21,000002,Vente,157000,9000,,RUE CONDORCET,0393,91700,91235,Fleury-Mérogis,91,,,91235000AA0115,,,,,,,,,,,,,0,4,Local industriel. commercial ou assimilé,,0,S,sols,,,2537,2.385119,48.644644
2019-1360205,2019-04-10,000001,Vente,119000,281,,RUE DE LA COULEE VERTE,0410,91700,91235,Fleury-Mérogis,91,,,91235000AE0243,,,5096,,,,,,,,,,1,3,Dépendance,,0,,,,,,2.357144,48.640241
2019-1360205,2019-04-10,000001,Vente,119000,281,,RUE DE LA COULEE VERTE,0410,91700,91235,Fleury-Mérogis,91,,,91235000AE0243,,,5142,40,,,,,,,,,1,2,Appartement,40,2,,,,,,2.357144,48.640241
2019-1360234,2019-06-14,000001,Vente,175000,102,,RUE ANAIS NIN,0056,91700,91235,Fleury-Mérogis,91,,,91235000AE0187,,,53,61.7,,,,,,,,,1,2,Appartement,94,3,,,,,,2.35694,48.642227
2019-1360234,2019-06-14,000001,Vente,175000,89,,RUE HANNAH ARENDT,0810,91700,91235,Fleury-Mérogis,91,,,91235000AE0187,,,273,,,,,,,,,,1,3,Dépendance,,0,,,,,,2.35694,48.642227
2019-1360287,2019-06-27,000001,Vente,290000,25,,RUE DE LA COULEE VERTE,0410,91700,91235,Fleury-Mérogis,91,,,91235000AE0251,,,4,87.26,,,,,,,,,1,1,Maison,87,5,,,,,,2.357113,48.638302
2019-1360307,2019-06-28,000001,Vente,147900,459,,RUE DE LA COULEE VERTE,0410,91700,91235,Fleury-Mérogis,91,,,91235000AE0188,,,74,61.52,,,,,,,,,1,2,Appartement,61,3,,,,,,2.35824,48.641592
2019-1360307,2019-06-28,000001,Vente,147900,55,,RUE HANNAH ARENDT,0810,91700,91235,Fleury-Mérogis,91,,,91235000AE0188,,,265,,,,,,,,,,1,3,Dépendance,,0,,,,,,2.35824,48.641592
2019-1360494,2019-07-03,000001,Vente,177000,1,,RUE DU ZODIAQUE,2650,91700,91235,Fleury-Mérogis,91,,,91235000AA0066,,,,,,,,,,,,,0,,,,,S,sols,,,43,2.369968,48.644854
2019-1360543,2019-07-09,000001,Vente,245000,176,,RUE AIME CESAIRE,0030,91700,91235,Fleury-Mérogis,91,,,91235000AE0243,,28,,,,,,,,,,,0,,,,,,,,,,2.357144,48.640241
2019-1360591,2019-07-11,000002,Vente,4850000,9001,,RUE CLEMENT ADER,0368,91700,91235,Fleury-Mérogis,91,,,91235000AN0351,,,,,,,,,,,,,0,4,Local industriel. commercial ou assimilé,1848,0,S,sols,,,12275,2.358526,48.619906
2019-1360591,2019-07-11,000002,Vente,4850000,9001,,RUE CLEMENT ADER,0368,91700,91235,Fleury-Mérogis,91,,,91235000AN0351,,,,,,,,,,,,,0,4,Local industriel. commercial ou assimilé,407,0,S,sols,,,12275,2.358526,48.619906
2019-1360591,2019-07-11,000002,Vente,4850000,9001,,RUE CLEMENT ADER,0368,91700,91235,Fleury-Mérogis,91,,,91235000AN0351,,,,,,,,,,,,,0,4,Local industriel. commercial ou assimilé,1213,0,S,sols,,,12275,2.358526,48.619906
2019-1360591,2019-07-11,000002,Vente,4850000,9001,,RUE CLEMENT ADER,0368,91700,91235,Fleury-Mérogis,91,,,91235000AN0351,,,,,,,,,,,,,0,4,Local industriel. commercial ou assimilé,1954,0,S,sols,,,12275,2.358526,48.619906
2019-1360591,2019-07-11,000002,Vente,4850000,9001,,RUE CLEMENT ADER,0368,91700,91235,Fleury-Mérogis,91,,,91235000AN0351,,,,,,,,,,,,,0,4,Local industriel. commercial ou assimilé,583,0,S,sols,,,12275,2.358526,48.619906
2019-1360591,2019-07-11,000002,Vente,4850000,9001,,RUE CLEMENT ADER,0368,91700,91235,Fleury-Mérogis,91,,,91235000AN0351,,,,,,,,,,,,,0,4,Local industriel. commercial ou assimilé,1483,0,S,sols,,,12275,2.358526,48.619906
2019-1360591,2019-07-11,000002,Vente,4850000,9001,,RUE CLEMENT ADER,0368,91700,91235,Fleury-Mérogis,91,,,91235000AN0351,,,,,,,,,,,,,0,4,Local industriel. commercial ou assimilé,3862,0,S,sols,,,12275,2.358526,48.619906
2019-1360591,2019-07-11,000002,Vente,4850000,9001,,RUE CLEMENT ADER,0368,91700,91235,Fleury-Mérogis,91,,,91235000AN0351,,,,,,,,,,,,,0,4,Local industriel. commercial ou assimilé,,0,S,sols,,,12275,2.358526,48.619906
2019-1360656,2019-07-12,000001,Vente,176000,201,,RUE DE LA COULEE VERTE,0410,91700,91235,Fleury-Mérogis,91,,,91235000AE0252,,,215,66.35,,,,,,,,,1,2,Appartement,66,3,,,,,,2.357242,48.639548
2019-1360656,2019-07-12,000001,Vente,176000,179,,RUE DE LA COULEE VERTE,0410,91700,91235,Fleury-Mérogis,91,,,91235000AE0252,,,1053,,,,,,,,,,1,3,Dépendance,,0,,,,,,2.357242,48.639548
2019-1360656,2019-07-12,000001,Vente,176000,179,,RUE DE LA COULEE VERTE,0410,91700,91235,Fleury-Mérogis,91,,,91235000AE0252,,,1052,,,,,,,,,,1,3,Dépendance,,0,,,,,,2.357242,48.639548
2019-1360846,2019-07-23,000001,Vente,32600,355,,RUE ANAIS NIN,0056,91700,91235,Fleury-Mérogis,91,,,91235000AE0189,,,769,,,,,,,,,,1,3,Dépendance,,0,,,,,,2.358176,48.642356
2019-1360846,2019-07-23,000001,Vente,32600,355,,RUE ANAIS NIN,0056,91700,91235,Fleury-Mérogis,91,,,91235000AE0189,,,301,55.14,,,,,,,,,1,2,Appartement,55,3,,,,,,2.358176,48.642356
2019-1360866,2019-07-10,000001,Vente,198300,89,,RUE HANNAH ARENDT,0810,91700,91235,Fleury-Mérogis,91,,,91235000AE0187,,,207,,,,,,,,,,1,3,Dépendance,,0,,,,,,2.35694,48.642227
2019-1360866,2019-07-10,000001,Vente,198300,138,,RUE ANAIS NIN,0056,91700,91235,Fleury-Mérogis,91,,,91235000AE0187,,,17,67.96,,,,,,,,,1,2,Appartement,67,4,,,,,,2.35694,48.642227
2019-1361025,2019-08-02,000001,Vente,136900,179,,RUE DE LA COULEE VERTE,0410,91700,91235,Fleury-Mérogis,91,,,91235000AE0252,,,122,,,,,,,,,,1,2,Appartement,40,2,,,,,,2.357242,48.639548
2019-1361025,2019-08-02,000001,Vente,136900,179,,RUE DE LA COULEE VERTE,0410,91700,91235,Fleury-Mérogis,91,,,91235000AE0252,,,1094,,,,,,,,,,1,3,Dépendance,,0,,,,,,2.357242,48.639548
2019-1361073,2019-07-17,000001,Vente,1600000,24,,RUE CONDORCET,0393,91700,91235,Fleury-Mérogis,91,,,91235000AA0089,,,,,,,,,,,,,0,,,,,AB,terrains a bâtir,,,314,2.384525,48.644393
2019-1361073,2019-07-17,000001,Vente,1600000,24,,RUE CONDORCET,0393,91700,91235,Fleury-Mérogis,91,,,91235000AA0095,,,,,,,,,,,,,0,4,Local industriel. commercial ou assimilé,1870,0,S,sols,,,6211,2.38394,48.6442
2019-1361129,2019-07-19,000001,Vente,142600,89,,RUE HANNAH ARENDT,0810,91700,91235,Fleury-Mérogis,91,,,91235000AE0187,,,235,,,,,,,,,,1,3,Dépendance,,0,,,,,,2.35694,48.642227
2019-1361129,2019-07-19,000001,Vente,142600,102,,RUE ANAIS NIN,0056,91700,91235,Fleury-Mérogis,91,,,91235000AE0187,,,39,52.58,,,,,,,,,1,2,Appartement,52,3,,,,,,2.35694,48.642227
2019-1361131,2019-07-16,000001,Vente,137500,26,,RUE MARTIN LUTHER KING,1477,91700,91235,Fleury-Mérogis,91,,,91235000AE0253,,,4,39.6,,,,,,,,,1,2,Appartement,39,2,,,,,,2.359098,48.637553
2019-1361131,2019-07-16,000001,Vente,137500,26,,RUE MARTIN LUTHER KING,1477,91700,91235,Fleury-Mérogis,91,,,91235000AE0253,,,151,,,,,,,,,,1,3,Dépendance,,0,,,,,,2.359098,48.637553
2019-1361200,2019-07-12,000001,Vente,127000,397,,RUE MARCHAND ET FERAOUN,1470,91700,91235,Fleury-Mérogis,91,,,91235000AE0240,,,178,42.3,,,,,,,,,1,2,Appartement,42,2,,,,,,2.357233,48.641118
2019-1361200,2019-07-12,000001,Vente,127000,353,,RUE MARCHAND ET FERAOUN,1470,91700,91235,Fleury-Mérogis,91,,,91235000AE0240,,,409,,,,,,,,,,1,3,Dépendance,,0,,,,,,2.357233,48.641118
2019-1361283,2019-07-31,000001,Vente,175000,8,,RUE DES PETITS CHAMPS,1800,91700,91235,Fleury-Mérogis,91,,,91235000AM0267,,,,,,,,,,,,,0,,,,,AB,terrains a bâtir,,,1025,2.363286,48.630594
2019-1361285,2019-07-30,000001,Vente,180000,201,,RUE DE LA COULEE VERTE,0410,91700,91235,Fleury-Mérogis,91,,,91235000AE0252,,,206,64,,,,,,,,,1,2,Appartement,65,3,,,,,,2.357242,48.639548
2019-1361285,2019-07-30,000001,Vente,180000,179,,RUE DE LA COULEE VERTE,0410,91700,91235,Fleury-Mérogis,91,,,91235000AE0252,,,1105,,,,,,,,,,1,3,Dépendance,,0,,,,,,2.357242,48.639548
2019-1361285,2019-07-30,000001,Vente,180000,179,,RUE DE LA COULEE VERTE,0410,91700,91235,Fleury-Mérogis,91,,,91235000AE0252,,,1104,,,,,,,,,,1,3,Dépendance,,0,,,,,,2.357242,48.639548
2019-1361535,2019-08-23,000001,Vente,90000,4,,RUE DES PETITS CHAMPS,1800,91700,91235,Fleury-Mérogis,91,,,91235000AM0104,,,23,,,,,,,,,,1,3,Dépendance,,0,,,,,,2.362004,48.630251
2019-1361535,2019-08-23,000001,Vente,90000,4,,RUE DES PETITS CHAMPS,1800,91700,91235,Fleury-Mérogis,91,,,91235000AM0104,,,15,,7,28.65,,,,,,,2,2,Appartement,43,2,,,,,,2.362004,48.630251
2019-1361538,2019-08-23,000001,Vente,129900,26,,RUE MARTIN LUTHER KING,1477,91700,91235,Fleury-Mérogis,91,,,91235000AE0253,,,9,51.22,,,,,,,,,1,2,Appartement,51,2,,,,,,2.359098,48.637553
2019-1361538,2019-08-23,000001,Vente,129900,26,,RUE MARTIN LUTHER KING,1477,91700,91235,Fleury-Mérogis,91,,,91235000AE0253,,,160,,,,,,,,,,1,3,Dépendance,,0,,,,,,2.359098,48.637553
2019-1361552,2019-09-02,000001,Vente,260000,17,B,RUE DES PETITS CHAMPS,1800,91700,91235,Fleury-Mérogis,91,,,91235000AM0046,,,,,,,,,,,,,0,2,Appartement,40,2,S,sols,,,582,2.36394,48.630003
2019-1361552,2019-09-02,000001,Vente,260000,17,B,RUE DES PETITS CHAMPS,1800,91700,91235,Fleury-Mérogis,91,,,91235000AM0046,,,,,,,,,,,,,0,2,Appartement,45,2,S,sols,,,582,2.36394,48.630003
2019-1361552,2019-09-02,000001,Vente,260000,17,B,RUE DES PETITS CHAMPS,1800,91700,91235,Fleury-Mérogis,91,,,91235000AM0046,,,,,,,,,,,,,0,2,Appartement,24,1,S,sols,,,582,2.36394,48.630003
2019-1361552,2019-09-02,000001,Vente,260000,17,B,RUE DES PETITS CHAMPS,1800,91700,91235,Fleury-Mérogis,91,,,91235000AM0046,,,,,,,,,,,,,0,2,Appartement,45,2,S,sols,,,582,2.36394,48.630003
2019-1361664,2019-08-29,000001,Vente,139800,281,,RUE DE LA COULEE VERTE,0410,91700,91235,Fleury-Mérogis,91,,,91235000AE0243,,,5024,,,,,,,,,,1,3,Dépendance,,0,,,,,,2.357144,48.640241
2019-1361664,2019-08-29,000001,Vente,139800,341,,RUE DE LA COULEE VERTE,0410,91700,91235,Fleury-Mérogis,91,,,91235000AE0243,,,5172,58,,,,,,,,,1,2,Appartement,58,3,,,,,,2.357144,48.640241
2019-1361744,2019-08-20,000001,Vente,600000,5,,RUE AMBROISE CROIZAT,0053,91700,91235,Fleury-Mérogis,91,,,91235000AN0281,,,,,,,,,,,,,0,4,Local industriel. commercial ou assimilé,1487,0,S,sols,,,3013,2.361663,48.623397
2019-1361797,2019-09-02,000001,Vente,158925,3,,RUE MARIE LAURENCIN,1400,91700,91235,Fleury-Mérogis,91,,,91235000AE0149,,,,,,,,,,,,,0,1,Maison,93,5,S,sols,,,317,2.360127,48.641331
2019-1361832,2019-08-30,000001,Vente,154000,73,,RUE DE L'ECOUTE S'IL PLEUT,0495,91700,91235,Fleury-Mérogis,91,,,91235000AC0025,,,28,54.91,,,,,,,,,1,2,Appartement,54,3,,,,,,2.365417,48.640395
2019-1361832,2019-08-30,000001,Vente,154000,73,,RUE DE L'ECOUTE S'IL PLEUT,0495,91700,91235,Fleury-Mérogis,91,,,91235000AC0025,,,192,,,,,,,,,,1,3,Dépendance,,0,,,,,,2.365417,48.640395
2019-1361832,2019-08-30,000001,Vente,154000,73,,RUE DE L'ECOUTE S'IL PLEUT,0495,91700,91235,Fleury-Mérogis,91,,,91235000AC0025,,,166,,,,,,,,,,1,3,Dépendance,,0,,,,,,2.365417,48.640395
2019-1362010,2019-09-16,000001,Vente,142000,201,,RUE DE LA COULEE VERTE,0410,91700,91235,Fleury-Mérogis,91,,,91235000AE0252,,,240,,,,,,,,,,1,2,Appartement,41,2,,,,,,2.357242,48.639548
2019-1362010,2019-09-16,000001,Vente,142000,179,,RUE DE LA COULEE VERTE,0410,91700,91235,Fleury-Mérogis,91,,,91235000AE0252,,,1113,,,,,,,,,,1,3,Dépendance,,0,,,,,,2.357242,48.639548
2019-1362061,2019-09-16,000001,Vente,255507.98,33,,RUE DE LA MERANTAISE,1480,91700,91235,Fleury-Mérogis,91,,,91235000AH0053,,,11,89.86,42,,,,,,,,2,1,Maison,66,3,,,,,,2.36553,48.635658
2019-1362079,2019-09-19,000001,Vente,136022,73,,RUE DE L'ECOUTE S'IL PLEUT,0495,91700,91235,Fleury-Mérogis,91,,,91235000AC0025,,,137,,,,,,,,,,1,3,Dépendance,,0,,,,,,2.365417,48.640395
2019-1362079,2019-09-19,000001,Vente,136022,73,,RUE DE L'ECOUTE S'IL PLEUT,0495,91700,91235,Fleury-Mérogis,91,,,91235000AC0025,,,15,40.62,,,,,,,,,1,2,Appartement,40,2,,,,,,2.365417,48.640395
2019-1362087,2019-09-23,000001,Vente,170000,281,,RUE DE LA COULEE VERTE,0410,91700,91235,Fleury-Mérogis,91,,,91235000AE0243,,,5101,66.4,,,,,,,,,1,2,Appartement,67,1,,,,,,2.357144,48.640241
2019-1362087,2019-09-23,000001,Vente,170000,281,,RUE DE LA COULEE VERTE,0410,91700,91235,Fleury-Mérogis,91,,,91235000AE0243,,,5075,,,,,,,,,,1,3,Dépendance,,0,,,,,,2.357144,48.640241
2019-1362178,2019-09-06,000001,Vente,137500,201,,RUE DE LA COULEE VERTE,0410,91700,91235,Fleury-Mérogis,91,,,91235000AE0252,,,201,42.17,,,,,,,,,1,2,Appartement,42,2,,,,,,2.357242,48.639548
2019-1362178,2019-09-06,000001,Vente,137500,179,,RUE DE LA COULEE VERTE,0410,91700,91235,Fleury-Mérogis,91,,,91235000AE0252,,,1106,,,,,,,,,,1,3,Dépendance,,0,,,,,,2.357242,48.639548
2019-1362240,2019-09-12,000001,Vente,327000,15,,RUE DES ROSEAUX,1950,91700,91235,Fleury-Mérogis,91,,,91235000AD0221,,,,,,,,,,,,,0,1,Maison,100,5,S,sols,,,400,2.359594,48.645858
2019-1362340,2019-09-25,000001,Vente,205000,341,,RUE DE LA COULEE VERTE,0410,91700,91235,Fleury-Mérogis,91,,,91235000AE0243,,,5163,79,,,,,,,,,1,2,Appartement,79,4,,,,,,2.357144,48.640241
2019-1362340,2019-09-25,000001,Vente,205000,281,,RUE DE LA COULEE VERTE,0410,91700,91235,Fleury-Mérogis,91,,,91235000AE0243,,,5077,,,,,,,,,,1,3,Dépendance,,0,,,,,,2.357144,48.640241
2019-1362368,2019-09-24,000001,Vente,178000,281,,RUE DE LA COULEE VERTE,0410,91700,91235,Fleury-Mérogis,91,,,91235000AE0243,,,5148,58.5,,,,,,,,,1,2,Appartement,58,3,,,,,,2.357144,48.640241
2019-1362368,2019-09-24,000001,Vente,178000,281,,RUE DE LA COULEE VERTE,0410,91700,91235,Fleury-Mérogis,91,,,91235000AE0243,,,5010,,,,,,,,,,1,3,Dépendance,,0,,,,,,2.357144,48.640241
2019-1362385,2019-10-07,000001,Vente,250000,164,,RUE AIME CESAIRE,0030,91700,91235,Fleury-Mérogis,91,,,91235000AE0243,,29,,,,,,,,,,,0,,,,,,,,,,2.357144,48.640241
2019-1362481,2019-10-02,000001,Vente,200000,33,,RUE DU LAC,1200,91700,91235,Fleury-Mérogis,91,,,91235000AD0126,,,,,,,,,,,,,0,1,Maison,88,4,S,sols,,,379,2.359718,48.644082
2019-1362629,2019-09-27,000001,Vente,161000,179,,RUE DE LA COULEE VERTE,0410,91700,91235,Fleury-Mérogis,91,,,91235000AE0252,,,103,59.64,,,,,,,,,1,2,Appartement,60,3,,,,,,2.357242,48.639548
2019-1362629,2019-09-27,000001,Vente,161000,179,,RUE DE LA COULEE VERTE,0410,91700,91235,Fleury-Mérogis,91,,,91235000AE0252,,,1063,,,,,,,,,,1,3,Dépendance,,0,,,,,,2.357242,48.639548
2019-1362631,2019-10-15,000001,Vente,248000,25,,RUE DU TIERS ETAT,2300,91700,91235,Fleury-Mérogis,91,,,91235000AI0253,,,,,,,,,,,,,0,1,Maison,78,4,S,sols,,,404,2.364662,48.634316
2019-1362752,2019-10-18,000001,Vente,205000,353,,RUE MARCHAND ET FERAOUN,1470,91700,91235,Fleury-Mérogis,91,,,91235000AE0240,,,458,,,,,,,,,,1,3,Dépendance,,0,,,,,,2.357233,48.641118
2019-1362752,2019-10-18,000001,Vente,205000,212,,RUE AIME CESAIRE,0030,91700,91235,Fleury-Mérogis,91,,,91235000AE0240,,,201,79.96,,,,,,,,,1,2,Appartement,79,4,,,,,,2.357233,48.641118
2019-1362752,2019-10-18,000001,Vente,205000,353,,RUE MARCHAND ET FERAOUN,1470,91700,91235,Fleury-Mérogis,91,,,91235000AE0240,,,459,,,,,,,,,,1,3,Dépendance,,0,,,,,,2.357233,48.641118
2019-1362761,2019-10-09,000001,Vente,221000,281,,RUE DE LA COULEE VERTE,0410,91700,91235,Fleury-Mérogis,91,,,91235000AE0243,,,5005,,,,,,,,,,1,3,Dépendance,,0,,,,,,2.357144,48.640241
2019-1362761,2019-10-09,000001,Vente,221000,281,,RUE DE LA COULEE VERTE,0410,91700,91235,Fleury-Mérogis,91,,,91235000AE0243,,,5123,85,,,,,,,,,1,2,Appartement,85,4,,,,,,2.357144,48.640241
2019-1362761,2019-10-09,000001,Vente,221000,281,,RUE DE LA COULEE VERTE,0410,91700,91235,Fleury-Mérogis,91,,,91235000AE0243,,,5006,,,,,,,,,,1,3,Dépendance,,0,,,,,,2.357144,48.640241
2019-1362835,2019-09-17,000001,Vente,158000,55,,RUE HANNAH ARENDT,0810,91700,91235,Fleury-Mérogis,91,,,91235000AE0188,,,134,,,,,,,,,,1,3,Dépendance,,0,,,,,,2.35824,48.641592
2019-1362835,2019-09-17,000001,Vente,158000,459,,RUE DE LA COULEE VERTE,0410,91700,91235,Fleury-Mérogis,91,,,91235000AE0188,,,58,58.67,,,,,,,,,1,2,Appartement,58,3,,,,,,2.35824,48.641592
2019-1362847,2019-10-07,000001,Vente,190000,179,,RUE DE LA COULEE VERTE,0410,91700,91235,Fleury-Mérogis,91,,,91235000AE0252,,,1219,,,,,,,,,,1,3,Dépendance,,0,,,,,,2.357242,48.639548
2019-1362847,2019-10-07,000001,Vente,190000,73,,RUE AIME CESAIRE,0030,91700,91235,Fleury-Mérogis,91,,,91235000AE0252,,,410,71.03,,,,,,,,,1,2,Appartement,70,4,,,,,,2.357242,48.639548
2019-1362847,2019-10-07,000001,Vente,190000,179,,RUE DE LA COULEE VERTE,0410,91700,91235,Fleury-Mérogis,91,,,91235000AE0252,,,1218,,,,,,,,,,1,3,Dépendance,,0,,,,,,2.357242,48.639548
2019-1362876,2019-10-07,000001,Vente,158500,200,,RUE MARCHAND ET FERAOUN,1470,91700,91235,Fleury-Mérogis,91,,,91235000AE0235,,,130,60.5,172,,,,,,,,2,2,Appartement,60,3,,,,,,2.359838,48.641084
2019-1362876,2019-10-07,000001,Vente,158500,9001,,RUE MARC CHAGALL,1370,91700,91235,Fleury-Mérogis,91,,,91235000AE0235,,,331,,,,,,,,,,1,3,Dépendance,,0,,,,,,2.359838,48.641084
2019-1363249,2019-11-04,000001,Vente,142000,355,,RUE ANAIS NIN,0056,91700,91235,Fleury-Mérogis,91,,,91235000AE0189,,,768,,,,,,,,,,1,3,Dépendance,,0,,,,,,2.358176,48.642356
2019-1363249,2019-11-04,000001,Vente,142000,319,,RUE ANAIS NIN,0056,91700,91235,Fleury-Mérogis,91,,,91235000AE0189,,,408,51.76,,,,,,,,,1,2,Appartement,51,3,,,,,,2.358176,48.642356