id_mutation,date_mutation,numero_disposition,nature_mutation,valeur_fonciere,adresse_numero,adresse_suffixe,adresse_nom_voie,adresse_code_voie,code_postal,code_commune,nom_commune,code_departement,ancien_code_commune,ancien_nom_commune,id_parcelle,ancien_id_parcelle,numero_volume,lot1_numero,lot1_surface_carrez,lot2_numero,lot2_surface_carrez,lot3_numero,lot3_surface_carrez,lot4_numero,lot4_surface_carrez,lot5_numero,lot5_surface_carrez,nombre_lots,code_type_local,type_local,surface_reelle_bati,nombre_pieces_principales,code_nature_culture,nature_culture,code_nature_culture_speciale,nature_culture_speciale,surface_terrain,longitude,latitude
2019-1357416,2019-06-17,000001,Vente,100000,,,LA FOLIE,B012,91400,91534,Saclay,91,,,91534000ZX0039,,,,,,,,,,,,,0,,,,,L,landes,FRICH,Friche,1050,2.182868,48.730788
2019-1357416,2019-06-17,000001,Vente,100000,,,LES ANGOULEVENTS,B001,91400,91534,Saclay,91,,,91534000ZY0023,,,,,,,,,,,,,0,,,,,L,landes,FRICH,Friche,3925,2.174003,48.734608
2019-1357416,2019-06-17,000001,Vente,100000,,,LES ANGOULEVENTS,B001,91400,91534,Saclay,91,,,91534000ZY0024,,,,,,,,,,,,,0,,,,,L,landes,FRICH,Friche,12225,2.187137,48.73985
2019-1357416,2019-06-17,000001,Vente,100000,,,LA FOLIE,B012,91400,91534,Saclay,91,,,91534000ZY0025,,,,,,,,,,,,,0,,,,,L,landes,FRICH,Friche,10905,2.17977,48.732451
2019-1370528,2019-01-15,000001,Vente,450000,5044,A,LA FOLIE,B012,91400,91534,Saclay,91,,,91534000ZY0146,,,,,,,,,,,,,0,2,Appartement,100,4,S,sols,,,2697,2.183269,48.73158
2019-1370528,2019-01-15,000001,Vente,450000,5044,A,LA FOLIE,B012,91400,91534,Saclay,91,,,91534000ZY0146,,,,,,,,,,,,,0,4,Local industriel. commercial ou assimilé,36,0,S,sols,,,2697,2.183269,48.73158
2019-1370528,2019-01-15,000001,Vente,450000,5044,A,LA FOLIE,B012,91400,91534,Saclay,91,,,91534000ZY0146,,,,,,,,,,,,,0,4,Local industriel. commercial ou assimilé,509,0,S,sols,,,2697,2.183269,48.73158
2019-1370528,2019-01-15,000001,Vente,450000,5044,A,LA FOLIE,B012,91400,91534,Saclay,91,,,91534000ZY0146,,,,,,,,,,,,,0,4,Local industriel. commercial ou assimilé,450,0,S,sols,,,2697,2.183269,48.73158
2019-1370528,2019-01-15,000001,Vente,450000,5044,A,LA FOLIE,B012,91400,91534,Saclay,91,,,91534000ZY0146,,,,,,,,,,,,,0,3,Dépendance,,0,T,terres,,,11181,2.183269,48.73158
2019-1370528,2019-01-15,000001,Vente,450000,5044,A,LA FOLIE,B012,91400,91534,Saclay,91,,,91534000ZY0146,,,,,,,,,,,,,0,4,Local industriel. commercial ou assimilé,36,0,T,terres,,,11181,2.183269,48.73158
2019-1370528,2019-01-15,000001,Vente,450000,5044,A,LA FOLIE,B012,91400,91534,Saclay,91,,,91534000ZY0146,,,,,,,,,,,,,0,4,Local industriel. commercial ou assimilé,509,0,T,terres,,,11181,2.183269,48.73158
2019-1370528,2019-01-15,000001,Vente,450000,5044,A,LA FOLIE,B012,91400,91534,Saclay,91,,,91534000ZY0146,,,,,,,,,,,,,0,3,Dépendance,,0,S,sols,,,2697,2.183269,48.73158
2019-1370528,2019-01-15,000001,Vente,450000,5044,A,LA FOLIE,B012,91400,91534,Saclay,91,,,91534000ZY0146,,,,,,,,,,,,,0,2,Appartement,30,1,S,sols,,,2697,2.183269,48.73158
2019-1370528,2019-01-15,000001,Vente,450000,5044,A,LA FOLIE,B012,91400,91534,Saclay,91,,,91534000ZY0146,,,,,,,,,,,,,0,2,Appartement,20,1,S,sols,,,2697,2.183269,48.73158
2019-1370528,2019-01-15,000001,Vente,450000,5044,A,LA FOLIE,B012,91400,91534,Saclay,91,,,91534000ZY0146,,,,,,,,,,,,,0,2,Appartement,20,1,S,sols,,,2697,2.183269,48.73158
2019-1370528,2019-01-15,000001,Vente,450000,5044,A,LA FOLIE,B012,91400,91534,Saclay,91,,,91534000ZY0146,,,,,,,,,,,,,0,2,Appartement,20,1,S,sols,,,2697,2.183269,48.73158
2019-1370528,2019-01-15,000001,Vente,450000,5044,A,LA FOLIE,B012,91400,91534,Saclay,91,,,91534000ZY0146,,,,,,,,,,,,,0,2,Appartement,30,1,T,terres,,,11181,2.183269,48.73158
2019-1370528,2019-01-15,000001,Vente,450000,5044,A,LA FOLIE,B012,91400,91534,Saclay,91,,,91534000ZY0146,,,,,,,,,,,,,0,2,Appartement,20,1,T,terres,,,11181,2.183269,48.73158
2019-1370528,2019-01-15,000001,Vente,450000,5044,A,LA FOLIE,B012,91400,91534,Saclay,91,,,91534000ZY0146,,,,,,,,,,,,,0,2,Appartement,20,1,T,terres,,,11181,2.183269,48.73158
2019-1370528,2019-01-15,000001,Vente,450000,5044,A,LA FOLIE,B012,91400,91534,Saclay,91,,,91534000ZY0146,,,,,,,,,,,,,0,2,Appartement,20,1,T,terres,,,11181,2.183269,48.73158
2019-1370528,2019-01-15,000001,Vente,450000,5044,A,LA FOLIE,B012,91400,91534,Saclay,91,,,91534000ZY0146,,,,,,,,,,,,,0,2,Appartement,100,4,T,terres,,,11181,2.183269,48.73158
2019-1370528,2019-01-15,000001,Vente,450000,5044,A,LA FOLIE,B012,91400,91534,Saclay,91,,,91534000ZY0146,,,,,,,,,,,,,0,4,Local industriel. commercial ou assimilé,450,0,T,terres,,,11181,2.183269,48.73158
2019-1370553,2019-01-17,000001,Vente,420000,5005,,RUE ROBERT THOMAS,0465,91400,91534,Saclay,91,,,91534000AB0045,,,,,,,,,,,,,0,3,Dépendance,,0,S,sols,,,15,2.169827,48.730662
2019-1370553,2019-01-17,000001,Vente,420000,15,,RUE ROBERT THOMAS,0465,91400,91534,Saclay,91,,,91534000AB0048,,,,,,,,,,,,,0,1,Maison,88,4,S,sols,,,189,2.169785,48.730598
2019-1370687,2019-02-05,000001,Vente,376800,24,,RUE DE VAUBOYEN,0520,91400,91534,Saclay,91,,,915340000A0556,,,,,,,,,,,,,0,,,,,S,sols,,,263,,
2019-1370687,2019-02-05,000001,Vente,376800,24,,RUE DE VAUBOYEN,0520,91400,91534,Saclay,91,,,915340000A0557,,,,,,,,,,,,,0,1,Maison,80,5,S,sols,,,164,,
2019-1370802,2019-02-14,000001,Vente,341000,17,,RUE DU COLOMBIER,0114,91400,91534,Saclay,91,,,91534000AB0196,,,10,79.14,,,,,,,,,1,2,Appartement,80,4,,,,,,2.171584,48.730954
2019-1370802,2019-02-14,000001,Vente,341000,17,,RUE DU COLOMBIER,0114,91400,91534,Saclay,91,,,91534000AB0196,,,29,,,,,,,,,,1,3,Dépendance,,0,,,,,,2.171584,48.730954
2019-1370839,2019-01-31,000001,Vente,476000,1,,RUE PASTEUR,0360,91400,91534,Saclay,91,,,915340000A0151,,,,,,,,,,,,,0,1,Maison,161,7,S,sols,,,413,2.178467,48.757283
2019-1370925,2019-02-19,000001,Vente,416000,10,,RUE DE LA MARTINIERE,0220,91400,91534,Saclay,91,,,91534000AB0352,,,1060,,,,,,,,,,1,3,Dépendance,,0,,,,,,2.174751,48.72928
2019-1370925,2019-02-19,000001,Vente,416000,10,,RUE DE LA MARTINIERE,0220,91400,91534,Saclay,91,,,91534000AB0352,,,1013,110.02,,,,,,,,,1,2,Appartement,109,5,,,,,,2.174751,48.72928
2019-1370925,2019-02-19,000001,Vente,416000,10,,RUE DE LA MARTINIERE,0220,91400,91534,Saclay,91,,,91534000AB0352,,,1061,,,,,,,,,,1,3,Dépendance,,0,,,,,,2.174751,48.72928
2019-1370954,2019-03-07,000001,Vente,216000,18,,PL DE LA REPUBLIQUE,0440,91400,91534,Saclay,91,,,915340000C0201,,,36,,,,,,,,,,1,2,Appartement,41,2,,,,,,,
2019-1370954,2019-03-07,000001,Vente,216000,18,,PL DE LA REPUBLIQUE,0440,91400,91534,Saclay,91,,,915340000C0201,,,36,,,,,,,,,,1,3,Dépendance,,0,,,,,,,
2019-1370980,2019-02-14,000001,Vente,10000,18,,PL DE LA REPUBLIQUE,0440,91400,91534,Saclay,91,,,915340000C0201,,,23,,,,,,,,,,1,3,Dépendance,,0,,,,,,,
2019-1370980,2019-02-14,000001,Vente,10000,18,,PL DE LA REPUBLIQUE,0440,91400,91534,Saclay,91,,,915340000C0201,,,24,,,,,,,,,,1,3,Dépendance,,0,,,,,,,
2019-1371396,2019-04-18,000001,Vente,200000,1,,RUE DU GRAND CHEMIN,0189,91400,91534,Saclay,91,,,91534000AB0269,,,,,,,,,,,,,0,1,Maison,88,4,S,sols,,,242,2.171435,48.730006
2019-1371567,2019-05-06,000001,Vente,290000,,,RUE CURIE,0140,91400,91534,Saclay,91,,,915340000A1563,,,,,,,,,,,,,0,,,,,AB,terrains a bâtir,,,315,2.177177,48.757501
2019-1371650,2019-05-02,000001,Vente,548000,18,,ALL DES BOULEAUX,0065,91400,91534,Saclay,91,,,91534000ZY0057,,,,,,,,,,,,,0,1,Maison,92,4,S,sols,,,638,2.172799,48.73279
2019-1371825,2019-06-07,000001,Vente,509000,11,,RUE EMILE ZOLA,0171,91400,91534,Saclay,91,,,915340000A1408,,,,,,,,,,,,,0,1,Maison,96,4,S,sols,,,118,,
2019-1371825,2019-06-07,000001,Vente,509000,11,,RUE EMILE ZOLA,0171,91400,91534,Saclay,91,,,915340000A1418,,,,,,,,,,,,,0,,,,,S,sols,,,228,,
2019-1371932,2019-06-11,000001,Vente,506500,77,,RUE DE VILLERAS,0560,91400,91534,Saclay,91,,,915340000A1188,,,,,,,,,,,,,0,1,Maison,96,5,S,sols,,,232,2.177638,48.753397
2019-1371938,2019-06-14,000001,Vente,266666,11,,RUE DE PARIS,0340,91400,91534,Saclay,91,,,915340000C0220,,,,,,,,,,,,,0,2,Appartement,34,2,S,sols,,,56,2.174033,48.731518
2019-1371938,2019-06-14,000001,Vente,266666,11,,RUE DE PARIS,0340,91400,91534,Saclay,91,,,915340000C0220,,,,,,,,,,,,,0,2,Appartement,36,2,S,sols,,,56,2.174033,48.731518
2019-1371938,2019-06-14,000001,Vente,266666,11,,RUE DE PARIS,0340,91400,91534,Saclay,91,,,915340000C0220,,,,,,,,,,,,,0,3,Dépendance,,0,S,sols,,,56,2.174033,48.731518
2019-1371944,2019-05-21,000001,Vente,173000,39,B,RUE ARTHUR RIMBAUD,0030,91400,91534,Saclay,91,,,915340000A1525,,,59,,,,,,,,,,1,3,Dépendance,,0,,,,,,2.172819,48.75526
2019-1371944,2019-05-21,000001,Vente,173000,39,B,RUE ARTHUR RIMBAUD,0030,91400,91534,Saclay,91,,,915340000A1525,,,31,37.87,,,,,,,,,1,2,Appartement,38,2,,,,,,2.172819,48.75526
2019-1372001,2019-06-20,000001,Vente,2285000,4,,RUE RENE RAZEL,0461,91400,91534,Saclay,91,,,91534000ZY0147,,,78,,79,,80,,81,,82,,14,4,Local industriel. commercial ou assimilé,371,0,,,,,,,
2019-1372001,2019-06-20,000001,Vente,2285000,4,,RUE RENE RAZEL,0461,91400,91534,Saclay,91,,,91534000ZY0147,,,27,,28,,29,,3,,30,,11,4,Local industriel. commercial ou assimilé,245,0,,,,,,,
2019-1372001,2019-06-20,000001,Vente,2285000,4,,RUE RENE RAZEL,0461,91400,91534,Saclay,91,,,91534000ZY0147,,,10,,100,,101,,102,,91,,13,4,Local industriel. commercial ou assimilé,222,0,,,,,,,
2019-1372001,2019-06-20,000001,Vente,2285000,4,,RUE RENE RAZEL,0461,91400,91534,Saclay,91,,,91534000ZY0147,,,41,,42,,43,,47,,48,,12,4,Local industriel. commercial ou assimilé,268,0,,,,,,,
2019-1372001,2019-06-20,000001,Vente,2285000,4,,RUE RENE RAZEL,0461,91400,91534,Saclay,91,,,91534000ZY0147,,,17,,18,,19,,2,,20,,11,4,Local industriel. commercial ou assimilé,269,0,,,,,,,
2019-1372001,2019-06-20,000001,Vente,2285000,4,,RUE RENE RAZEL,0461,91400,91534,Saclay,91,,,91534000ZY0147,,,37,,38,,39,,40,,5,,5,4,Local industriel. commercial ou assimilé,146,0,,,,,,,
2019-1372001,2019-06-20,000001,Vente,2285000,4,,RUE RENE RAZEL,0461,91400,91534,Saclay,91,,,91534000ZY0147,,,55,,56,,57,,58,,59,,9,4,Local industriel. commercial ou assimilé,196,0,,,,,,,
2019-1372042,2019-06-27,000001,Vente,535800,38,,RUE DE SACALY,0491,91400,91534,Saclay,91,,,91534000AB0235,,,,,,,,,,,,,0,1,Maison,155,8,S,sols,,,355,2.173008,48.729234
2019-1372083,2019-07-05,000001,Vente,250000,4,,RUE RENE RAZEL,0461,91400,91534,Saclay,91,,,91534000ZY0147,,,12,,13,,14,,15,,16,,10,4,Local industriel. commercial ou assimilé,204,0,,,,,,,
2019-1372129,2019-07-12,000001,Vente,240000,16,,RUE CHATEAUBRIAND,0100,91400,91534,Saclay,91,,,915340000A1036,,,,,,,,,,,,,0,1,Maison,129,5,S,sols,,,324,2.182966,48.753079
2019-1372160,2019-07-05,000001,Vente,894700,51,,RUE EMILE ZOLA,0171,91400,91534,Saclay,91,,,915340000A1315,,,,,,,,,,,,,0,1,Maison,210,5,S,sols,,,731,2.18661,48.752816
2019-1372191,2019-06-25,000001,Vente,265000,10,,RUE DE LA MARTINIERE,0220,91400,91534,Saclay,91,,,91534000AB0352,,,1022,62.43,,,,,,,,,1,2,Appartement,60,3,,,,,,2.174751,48.72928
2019-1372191,2019-06-25,000001,Vente,265000,10,,RUE DE LA MARTINIERE,0220,91400,91534,Saclay,91,,,91534000AB0352,,,1034,,,,,,,,,,1,3,Dépendance,,0,,,,,,2.174751,48.72928
2019-1372191,2019-06-25,000001,Vente,265000,10,,RUE DE LA MARTINIERE,0220,91400,91534,Saclay,91,,,91534000AB0352,,,1035,,,,,,,,,,1,3,Dépendance,,0,,,,,,2.174751,48.72928
2019-1372243,2019-07-17,000001,Vente,419600,36,,RUE MONTESQUIEU,0260,91400,91534,Saclay,91,,,915340000A0480,,,,,,,,,,,,,0,1,Maison,72,4,S,sols,,,228,2.18452,48.753743
2019-1372411,2019-07-03,000001,Vente,574600,5,,RUE VOLTAIRE,0580,91400,91534,Saclay,91,,,915340000A0453,,,,,,,,,,,,,0,1,Maison,88,4,S,sols,,,354,2.184338,48.754159
2019-1372412,2019-07-19,000001,Vente,300000,33,,RUE VICTOR HUGO,0540,91400,91534,Saclay,91,,,915340000A0360,,,,,,,,,,,,,0,1,Maison,48,3,S,sols,,,367,2.181736,48.753525
2019-1372414,2019-07-03,000001,Vente,540096.6,41,,RUE VICTOR HUGO,0540,91400,91534,Saclay,91,,,915340000A1000,,,,,,,,,,,,,0,1,Maison,106,4,S,sols,,,262,2.181776,48.753153
2019-1372439,2019-07-25,000001,Vente,534000,2,,RUE CHARLES THOMASSIN,0080,91400,91534,Saclay,91,,,915340000C0520,,,,,,,,,,,,,0,1,Maison,111,5,S,sols,,,412,2.172867,48.73137
2019-1372491,2019-07-17,000001,Vente,623000,6,,RUE AMPERE,0020,91400,91534,Saclay,91,,,915340000A0686,,,,,,,,,,,,,0,1,Maison,138,4,J,jardins,POTAG,Jardin potager,282,,
2019-1372491,2019-07-17,000001,Vente,623000,6,,RUE AMPERE,0020,91400,91534,Saclay,91,,,915340000A0686,,,,,,,,,,,,,0,1,Maison,138,4,S,sols,,,15,,
2019-1372491,2019-07-17,000001,Vente,623000,,,RUE AMPERE,0020,91400,91534,Saclay,91,,,915340000A0919,,,,,,,,,,,,,0,,,,,S,sols,,,59,,
2019-1372594,2019-08-07,000001,Vente,502000,10,,IMP DU LAVOIR,0206,91400,91534,Saclay,91,,,915340000C0464,,,4,102.38,,,,,,,,,1,1,Maison,118,6,,,,,,2.172887,48.731771
2019-1372897,2019-08-23,000001,Vente,395950,5002,,RUE ROBERT THOMAS,0465,91400,91534,Saclay,91,,,91534000AB0032,,,,,,,,,,,,,0,3,Dépendance,,0,S,sols,,,15,2.170558,48.730574
2019-1372897,2019-08-23,000001,Vente,395950,5,,RUE ROBERT THOMAS,0465,91400,91534,Saclay,91,,,91534000AB0038,,,,,,,,,,,,,0,1,Maison,76,4,S,sols,,,141,2.170367,48.730627
2019-1372898,2019-08-22,000001,Vente,290000,17,,RUE DU COLOMBIER,0114,91400,91534,Saclay,91,,,91534000AB0196,,,34,,,,,,,,,,1,3,Dépendance,,0,,,,,,2.171584,48.730954
2019-1372898,2019-08-22,000001,Vente,290000,17,,RUE DU COLOMBIER,0114,91400,91534,Saclay,91,,,91534000AB0196,,,9,81.79,,,,,,,,,1,2,Appartement,80,4,,,,,,2.171584,48.730954
2019-1372902,2019-08-23,000001,Vente,529250,31,,RUE ROBERT THOMAS,0465,91400,91534,Saclay,91,,,91534000AB0358,,,,,,,,,,,,,0,1,Maison,117,5,S,sols,,,374,2.168398,48.73034
2019-1373005,2019-09-04,000001,Vente,487550,23,,RUE DE L EGALITE,0167,91400,91534,Saclay,91,,,91534000AB0282,,,,,,,,,,,,,0,1,Maison,159,7,S,sols,,,534,2.175704,48.729793
2019-1373007,2019-09-04,000001,Vente,372400,4,,RUE DE LA DISTILLERIE,0161,91400,91534,Saclay,91,,,91534000ZY0217,,,,,,,,,,,,,0,1,Maison,79,4,S,sols,,,93,2.172635,48.733727
2019-1373007,2019-09-04,000001,Vente,372400,,,LE CLOS DE L HOPITAL,B003,91400,91534,Saclay,91,,,91534000ZY0253,,,,,,,,,,,,,0,,,,,S,sols,,,25,2.172318,48.733397
2019-1373511,2019-10-11,000001,Vente,510000,61,,RUE VICTOR HUGO,0540,91400,91534,Saclay,91,,,915340000A0473,,,,,,,,,,,,,0,1,Maison,98,4,S,sols,,,308,,
2019-1373511,2019-10-11,000001,Vente,510000,,,LE VAL D ALBIAN,B032,91400,91534,Saclay,91,,,915340000A0936,,,,,,,,,,,,,0,,,,,S,sols,,,44,,
2019-1373671,2019-11-07,000001,Vente,1,,,LES TROIS MARES,B030,91400,91534,Saclay,91,,,91534000ZW0029,,,,,,,,,,,,,0,,,,,S,sols,,,9183,2.19424,48.721039
2019-1373671,2019-11-07,000001,Vente,1,,,LES TROIS MARES,B030,91400,91534,Saclay,91,,,91534000ZW0031,,,,,,,,,,,,,0,,,,,S,sols,,,22,2.194237,48.722178
2019-1373671,2019-11-07,000001,Vente,1,,,LES TROIS MARES,B030,91400,91534,Saclay,91,,,91534000ZW0032,,,,,,,,,,,,,0,,,,,S,sols,,,2874,2.193983,48.72155
2019-1373691,2019-11-08,000001,Vente,55000,12,A,PL DE LA REPUBLIQUE,0440,91400,91534,Saclay,91,,,915340000C0181,,,,,,,,,,,,,0,3,Dépendance,,0,T,terres,,,950,2.176367,48.731714
2019-1373691,2019-11-08,000001,Vente,55000,,,LE VILLAGE,B034,91400,91534,Saclay,91,,,915340000C0183,,,,,,,,,,,,,0,,,,,T,terres,,,855,2.175922,48.731903
2019-1373691,2019-11-08,000001,Vente,55000,,,LE VILLAGE,B034,91400,91534,Saclay,91,,,915340000C0184,,,,,,,,,,,,,0,,,,,T,terres,,,857,2.176022,48.731928
2019-1373794,2019-11-14,000001,Vente,64940,,,LE PETIT SACLAY,B022,91400,91534,Saclay,91,,,91534000ZV0017,,,,,,,,,,,,,0,,,,,T,terres,,,59395,2.164102,48.722254
2019-1374024,2019-12-09,000001,Vente,390000,24,,RUE DE VAUBOYEN,0520,91400,91534,Saclay,91,,,915340000A0556,,,,,,,,,,,,,0,,,,,S,sols,,,263,,
2019-1374024,2019-12-09,000001,Vente,390000,,,LE VAL D ALBIAN,B032,91400,91534,Saclay,91,,,915340000A1575,,,,,,,,,,,,,0,,,,,S,sols,,,20,,
2019-1374034,2019-12-17,000001,Vente,4278176,,,AV DE LA MARTINIERE,0040,91400,91534,Saclay,91,,,915340000D0042,,,,,,,,,,,,,0,,,,,P,prés,,,2945,2.179924,48.718535
2019-1374034,2019-12-17,000001,Vente,4278176,,,AV DE LA MARTINIERE,0040,91400,91534,Saclay,91,,,915340000D0086,,,,,,,,,,,,,0,,,,,T,terres,,,978,2.172833,48.71763
2019-1374034,2019-12-17,000001,Vente,4278176,,,AV DE LA MARTINIERE,0040,91400,91534,Saclay,91,,,915340000D0087,,,,,,,,,,,,,0,,,,,S,sols,,,525,2.173053,48.717598
2019-1374034,2019-12-17,000001,Vente,4278176,,,AV DE LA MARTINIERE,0040,91400,91534,Saclay,91,,,915340000D0088,,,,,,,,,,,,,0,,,,,T,terres,,,1190,2.173225,48.717561
2019-1374034,2019-12-17,000001,Vente,4278176,,,AV DE LA MARTINIERE,0040,91400,91534,Saclay,91,,,915340000D0108,,,,,,,,,,,,,0,,,,,T,terres,,,91828,2.177762,48.717295
2019-1374034,2019-12-17,000001,Vente,4278176,,,AV DE LA MARTINIERE,0040,91400,91534,Saclay,91,,,915340000D0110,,,,,,,,,,,,,0,,,,,S,sols,,,3899,2.180994,48.718627
2019-1374034,2019-12-17,000001,Vente,4278176,,,AV DE LA MARTINIERE,0040,91400,91534,Saclay,91,,,915340000D0112,,,,,,,,,,,,,0,,,,,T,terres,,,2903,2.179525,48.718371
2019-1374034,2019-12-17,000001,Vente,4278176,,,LA FAVEROLLE,B010,91400,91534,Saclay,91,,,91534000ZV0073,,,,,,,,,,,,,0,,,,,T,terres,,,16905,2.172902,48.716918
2019-1374034,2019-12-17,000001,Vente,4278176,,,LES TROIS MARES,B030,91400,91534,Saclay,91,,,91534000ZW0017,,,,,,,,,,,,,0,,,,,T,terres,,,24825,2.191408,48.720306
2019-1374100,2019-12-16,000001,Vente,701000,4,,RUE EMILE PASQUEREAU,0170,91400,91534,Saclay,91,,,915340000C0518,,,,,,,,,,,,,0,1,Maison,130,5,S,sols,,,414,2.173194,48.731409
2019-1374100,2019-12-16,000001,Vente,701000,4,,RUE EMILE PASQUEREAU,0170,91400,91534,Saclay,91,,,915340000C0518,,,,,,,,,,,,,0,4,Local industriel. commercial ou assimilé,18,0,S,sols,,,414,2.173194,48.731409
2019-1374102,2019-12-10,000001,Vente,128250,19,,RUE DU COLOMBIER,0114,91400,91534,Saclay,91,,,91534000AB0196,,,11,,,,,,,,,,1,2,Appartement,37,1,,,,,,2.171584,48.730954
2019-1374102,2019-12-10,000001,Vente,128250,19,,RUE DU COLOMBIER,0114,91400,91534,Saclay,91,,,91534000AB0196,,,28,,,,,,,,,,1,3,Dépendance,,0,,,,,,2.171584,48.730954
2019-1374218,2019-12-27,000001,Vente,570000,71,B,RUE VICTOR HUGO,0540,91400,91534,Saclay,91,,,915340000A0524,,,,,,,,,,,,,0,1,Maison,170,6,S,sols,,,510,2.186571,48.753792
2019-1374247,2019-12-27,000001,Vente,401900,8,,RUE DE PARIS,0340,91400,91534,Saclay,91,,,915340000C0442,,,,,,,,,,,,,0,1,Maison,180,6,S,sols,,,82,2.174292,48.731726
