id_mutation,date_mutation,numero_disposition,nature_mutation,valeur_fonciere,adresse_numero,adresse_suffixe,adresse_nom_voie,adresse_code_voie,code_postal,code_commune,nom_commune,code_departement,ancien_code_commune,ancien_nom_commune,id_parcelle,ancien_id_parcelle,numero_volume,lot1_numero,lot1_surface_carrez,lot2_numero,lot2_surface_carrez,lot3_numero,lot3_surface_carrez,lot4_numero,lot4_surface_carrez,lot5_numero,lot5_surface_carrez,nombre_lots,code_type_local,type_local,surface_reelle_bati,nombre_pieces_principales,code_nature_culture,nature_culture,code_nature_culture_speciale,nature_culture_speciale,surface_terrain,longitude,latitude
2019-1462383,2019-01-07,000001,Vente,416950,5,,SEN DES MURIERS,0210,95000,95074,Boisemont,95,,,950740000A0431,,,,,,,,,,,,,0,1,Maison,143,5,S,sols,,,1001,2.003735,49.02312
2019-1462487,2019-01-29,000001,Vente en l'état futur d'achèvement,343000,,,LES AULNAYS,B023,95000,95074,Boisemont,95,,,950740000A0659,,,,,,,,,,,,,0,,,,,AB,terrains a bâtir,,,331,2.000346,49.024132
2019-1462757,2019-02-13,000001,Vente en l'état futur d'achèvement,410000,,,LE PRIEURE,B022,95000,95074,Boisemont,95,,,950740000A0606,,,,,,,,,,,,,0,,,,,AB,terrains a bâtir,,,424,2.002198,49.024562
2019-1462757,2019-02-13,000001,Vente en l'état futur d'achèvement,410000,,,LE PRIEURE,B022,95000,95074,Boisemont,95,,,950740000A0610,,,,,,,,,,,,,0,,,,,AB,terrains a bâtir,,,167,2.002404,49.024629
2019-1462757,2019-02-13,000001,Vente en l'état futur d'achèvement,410000,,,LE PRIEURE,B022,95000,95074,Boisemont,95,,,950740000A0611,,,,,,,,,,,,,0,,,,,AB,terrains a bâtir,,,12,2.002527,49.024549
2019-1462757,2019-02-13,000001,Vente en l'état futur d'achèvement,410000,,,LE PRIEURE,B022,95000,95074,Boisemont,95,,,950740000A0665,,,,,,,,,,,,,0,,,,,AB,terrains a bâtir,,,93,2.002434,49.024531
2019-1463107,2019-02-22,000001,Vente,400000,70,,GR GRANDE RUE,0260,95000,95074,Boisemont,95,,,950740000A0548,,,,,,,,,,,,,0,1,Maison,200,6,J,jardins,POTAG,Jardin potager,827,2.004216,49.023068
2019-1463107,2019-02-22,000001,Vente,400000,70,,GR GRANDE RUE,0260,95000,95074,Boisemont,95,,,950740000A0548,,,,,,,,,,,,,0,1,Maison,200,6,S,sols,,,500,2.004216,49.023068
2019-1464168,2019-05-09,000001,Vente en l'état futur d'achèvement,336000,,,LES AULNAYS,B023,95000,95074,Boisemont,95,,,950740000A0653,,,,,,,,,,,,,0,,,,,AB,terrains a bâtir,,,240,2.000404,49.024998
2019-1464197,2019-04-29,000002,Vente,192000,,,LE MONTROUGE,B019,95000,95074,Boisemont,95,,,950740000B0834,,,,,,,,,,,,,0,,,,,AG,terrains d'agrément,,,300,1.997547,49.020782
2019-1464511,2019-05-20,000002,Vente,300000,8,,GR GRANDE RUE,0260,95000,95074,Boisemont,95,,,950740000A0669,,,,,,,,,,,,,0,1,Maison,204,7,S,sols,,,357,2.006504,49.025609
2019-1464804,2019-06-05,000001,Vente,240000,89,,GR GRANDE RUE,0260,95000,95074,Boisemont,95,,,950740000A0216,,,,,,,,,,,,,0,1,Maison,81,2,S,sols,,,457,2.001643,49.02139
2019-1464829,2019-06-13,000001,Vente,175000,,,LE MONTROUGE,B019,95000,95074,Boisemont,95,,,950740000B0818,,,,,,,,,,,,,0,,,,,AB,terrains a bâtir,,,870,1.996623,49.021487
2019-1464829,2019-06-13,000001,Vente,175000,,,LE MONTROUGE,B019,95000,95074,Boisemont,95,,,950740000B0821,,,,,,,,,,,,,0,,,,,S,sols,,,5,1.996615,49.021195
2019-1464881,2019-06-18,000001,Vente en l'état futur d'achèvement,420000,,,LES AULNAYS,B023,95000,95074,Boisemont,95,,,950740000A0655,,,,,,,,,,,,,0,,,,,AB,terrains a bâtir,,,1030,1.999999,49.024838
2019-1465091,2019-06-25,000001,Vente en l'état futur d'achèvement,455000,,,LES AULNAYS,B023,95000,95074,Boisemont,95,,,950740000A0656,,,,,,,,,,,,,0,,,,,AB,terrains a bâtir,,,1189,1.999853,49.024598
2019-1465116,2019-06-19,000001,Vente,307000,17,,RUE MAURICE FOUQUET,0160,95000,95074,Boisemont,95,,,950740000A0051,,,,,,,,,,,,,0,1,Maison,94,6,S,sols,,,121,2.006922,49.024923
2019-1465880,2019-07-15,000001,Vente,315500,9,,GR GRANDE RUE,0260,95000,95074,Boisemont,95,,,950740000A0031,,,,,,,,,,,,,0,1,Maison,87,4,S,sols,,,648,2.007154,49.025747
2019-1465885,2019-07-17,000001,Vente,138500,,,LA PORTE NEUVE,B021,95000,95074,Boisemont,95,,,950740000B0813,,,,,,,,,,,,,0,,,,,BS,taillis sous futaie,,,114,1.998267,49.018747
2019-1465885,2019-07-17,000001,Vente,138500,,,AV DES COTEAUX,0046,95000,95074,Boisemont,95,,,950740000B0816,,,,,,,,,,,,,0,,,,,BS,taillis sous futaie,,,1236,1.998372,49.0187
2019-1467457,2019-10-07,000001,Vente,450000,35,,GR GRANDE RUE,0260,95000,95074,Boisemont,95,,,950740000A0442,,,,,,,,,,,,,0,4,Local industriel. commercial ou assimilé,31,0,S,sols,,,932,2.007415,49.024342
2019-1467457,2019-10-07,000001,Vente,450000,35,,GR GRANDE RUE,0260,95000,95074,Boisemont,95,,,950740000A0442,,,,,,,,,,,,,0,1,Maison,184,6,S,sols,,,932,2.007415,49.024342
2019-1467737,2019-10-09,000001,Vente,564265,8,,SEN DES MURIERS,0210,95000,95074,Boisemont,95,,,950740000A0537,,,,,,,,,,,,,0,1,Maison,231,8,S,sols,,,881,2.002149,49.023096
2019-1467897,2019-10-31,000001,Vente en l'état futur d'achèvement,550000,,,LES AULNAYS,B023,95000,95074,Boisemont,95,,,950740000A0652,,,,,,,,,,,,,0,,,,,AB,terrains a bâtir,,,836,2.000523,49.025123
2019-1467937,2019-11-06,000001,Vente en l'état futur d'achèvement,369000,,,LE PRIEURE,B022,95000,95074,Boisemont,95,,,950740000A0613,,,,,,,,,,,,,0,,,,,AB,terrains a bâtir,,,39,2.002814,49.024256
2019-1467937,2019-11-06,000001,Vente en l'état futur d'achèvement,369000,,,LE PRIEURE,B022,95000,95074,Boisemont,95,,,950740000A0622,,,,,,,,,,,,,0,,,,,AB,terrains a bâtir,,,18,2.002864,49.024507
2019-1467937,2019-11-06,000001,Vente en l'état futur d'achèvement,369000,,,LE PRIEURE,B022,95000,95074,Boisemont,95,,,950740000A0633,,,,,,,,,,,,,0,,,,,AB,terrains a bâtir,,,476,2.002847,49.024378
2019-1468193,2019-11-15,000001,Vente en l'état futur d'achèvement,340000,,,LE PRIEURE,B022,95000,95074,Boisemont,95,,,950740000A0612,,,,,,,,,,,,,0,,,,,AB,terrains a bâtir,,,508,2.002672,49.024391
2019-1468193,2019-11-15,000001,Vente en l'état futur d'achèvement,340000,,,LE PRIEURE,B022,95000,95074,Boisemont,95,,,950740000A0632,,,,,,,,,,,,,0,,,,,AB,terrains a bâtir,,,16,2.002701,49.02449
2019-1468193,2019-11-15,000001,Vente en l'état futur d'achèvement,340000,,,LE PRIEURE,B022,95000,95074,Boisemont,95,,,950740000A0666,,,,,,,,,,,,,0,,,,,AB,terrains a bâtir,,,366,2.002586,49.024305
2019-1468359,2019-11-29,000001,Vente en l'état futur d'achèvement,490000,,,LES AULNAYS,B023,95000,95074,Boisemont,95,,,950740000A0658,,,,,,,,,,,,,0,,,,,AB,terrains a bâtir,,,1124,2.000016,49.024157
2019-1468888,2019-12-23,000001,Vente en l'état futur d'achèvement,349000,,,LE PRIEURE,B022,95000,95074,Boisemont,95,,,950740000A0645,,,,,,,,,,,,,0,,,,,AB,terrains a bâtir,,,402,2.003577,49.024849
2019-1468968,2019-12-20,000001,Vente,550000,92,,GR GRANDE RUE,0260,95000,95074,Boisemont,95,,,950740000A0471,,,,,,,,,,,,,0,1,Maison,166,6,AG,terrains d'agrément,,,355,2.002331,49.022348
2019-1468968,2019-12-20,000001,Vente,550000,92,,GR GRANDE RUE,0260,95000,95074,Boisemont,95,,,950740000A0471,,,,,,,,,,,,,0,1,Maison,166,6,S,sols,,,500,2.002331,49.022348
2019-1469109,2019-12-09,000001,Vente,125000,38,,RUE DE VAUREAL,0280,95000,95074,Boisemont,95,,,950740000A0553,,,1,35.55,,,,,,,,,1,2,Appartement,35,2,,,,,,2.006332,49.026008
2019-1469313,2019-02-07,000001,Vente,181800,38,,RUE DE VAUREAL,0280,95000,95074,Boisemont,95,,,950740000A0553,,,4,22.82,,,,,,,,,1,2,Appartement,23,1,,,,,,2.006332,49.026008
2019-1469313,2019-02-07,000001,Vente,181800,38,,RUE DE VAUREAL,0280,95000,95074,Boisemont,95,,,950740000A0553,,,2,24.35,,,,,,,,,1,2,Appartement,24,1,,,,,,2.006332,49.026008
