id_mutation,date_mutation,numero_disposition,nature_mutation,valeur_fonciere,adresse_numero,adresse_suffixe,adresse_nom_voie,adresse_code_voie,code_postal,code_commune,nom_commune,code_departement,ancien_code_commune,ancien_nom_commune,id_parcelle,ancien_id_parcelle,numero_volume,lot1_numero,lot1_surface_carrez,lot2_numero,lot2_surface_carrez,lot3_numero,lot3_surface_carrez,lot4_numero,lot4_surface_carrez,lot5_numero,lot5_surface_carrez,nombre_lots,code_type_local,type_local,surface_reelle_bati,nombre_pieces_principales,code_nature_culture,nature_culture,code_nature_culture_speciale,nature_culture_speciale,surface_terrain,longitude,latitude
2019-1486857,2019-01-16,000001,Vente,80300,32,,RES MASSABIELLE,A131,97110,97120,Pointe-à-Pitre,971,,,97120000AO0314,,,10,44.25,,,,,,,,,1,2,Appartement,49,3,,,,,,-61.530684,16.235617
2019-1486857,2019-01-16,000001,Vente,80300,32,,RES MASSABIELLE,A131,97110,97120,Pointe-à-Pitre,971,,,97120000AO0314,,,11,54.79,,,,,,,,,1,2,Appartement,55,4,,,,,,-61.530684,16.235617
2019-1486860,2019-01-24,000001,Vente,90000,24,,RUE DELGRES,0228,97110,97120,Pointe-à-Pitre,971,,,97120000AI0148,,,,,,,,,,,,,0,2,Appartement,120,5,S,sols,,,91,-61.53749,16.236151
2019-1486860,2019-01-24,000001,Vente,90000,24,,RUE DELGRES,0228,97110,97120,Pointe-à-Pitre,971,,,97120000AI0148,,,,,,,,,,,,,0,4,Local industriel. commercial ou assimilé,60,0,S,sols,,,91,-61.53749,16.236151
2019-1486860,2019-01-24,000001,Vente,90000,24,,RUE DELGRES,0228,97110,97120,Pointe-à-Pitre,971,,,97120000AI0148,,,,,,,,,,,,,0,4,Local industriel. commercial ou assimilé,60,0,S,sols,,,91,-61.53749,16.236151
2019-1486891,2019-01-21,000001,Vente,70000,8013,,RES CIBONEYE,A042,97110,97120,Pointe-à-Pitre,971,,,97120000AB0157,,,67,,,,,,,,,,1,2,Appartement,64,3,,,,,,-61.543369,16.246812
2019-1486894,2019-01-23,000001,Vente,90000,8001,,RES POINSETTIA BELAYE,A164,97110,97120,Pointe-à-Pitre,971,,,97120000AE0309,,,46,86.74,,,,,,,,,1,2,Appartement,96,5,,,,,,-61.53327,16.243066
2019-1486897,2019-01-15,000001,Vente,18000,72,B,RUE DUGOMMIER,0330,97110,97120,Pointe-à-Pitre,971,,,97120000AM0276,,,,,,,,,,,,,0,,,,,S,sols,,,87,-61.532196,16.238148
2019-1486925,2019-01-30,000001,Vente,230000,95,,RUE SCHOELCHER,0730,97110,97120,Pointe-à-Pitre,971,,,97120000AH0084,,,,,,,,,,,,,0,2,Appartement,63,3,S,sols,,,104,-61.53591,16.240314
2019-1486925,2019-01-30,000001,Vente,230000,95,,RUE SCHOELCHER,0730,97110,97120,Pointe-à-Pitre,971,,,97120000AH0084,,,,,,,,,,,,,0,4,Local industriel. commercial ou assimilé,30,0,S,sols,,,104,-61.53591,16.240314
2019-1486925,2019-01-30,000001,Vente,230000,95,,RUE SCHOELCHER,0730,97110,97120,Pointe-à-Pitre,971,,,97120000AH0084,,,,,,,,,,,,,0,2,Appartement,79,3,S,sols,,,104,-61.53591,16.240314
2019-1486925,2019-01-30,000001,Vente,230000,95,,RUE SCHOELCHER,0730,97110,97120,Pointe-à-Pitre,971,,,97120000AH0084,,,,,,,,,,,,,0,4,Local industriel. commercial ou assimilé,130,0,S,sols,,,104,-61.53591,16.240314
2019-1486926,2019-01-25,000001,Vente,95000,9001,,BD FAIDHERBE,0360,97110,97120,Pointe-à-Pitre,971,,,97120000AD0054,,,131,86.13,,,,,,,,,1,2,Appartement,84,5,,,,,,-61.536533,16.24155
2019-1486931,2019-01-25,000001,Vente,95000,9001,,BD FAIDHERBE,0360,97110,97120,Pointe-à-Pitre,971,,,97120000AD0054,,,135,86.19,,,,,,,,,1,2,Appartement,84,5,,,,,,-61.536533,16.24155
2019-1486932,2019-01-17,000001,Vente,60000,25,,RUE DU GEN RHUILLIER,0437,97110,97120,Pointe-à-Pitre,971,,,97120000AM0377,,,2,55.32,,,,,,,,,1,2,Appartement,47,1,,,,,,-61.533956,16.239116
2019-1486956,2019-01-31,000001,Vente,57000,32,,RES MASSABIELLE,A131,97110,97120,Pointe-à-Pitre,971,,,97120000AO0314,,,6,41.48,,,,,,,,,1,2,Appartement,49,3,,,,,,-61.530684,16.235617
2019-1486956,2019-01-31,000001,Vente,57000,9002,,TOUR MASSABIELLE,C106,97110,97120,Pointe-à-Pitre,971,,,97120000AO0436,,,46,,,,,,,,,,1,3,Dépendance,,0,,,,,,-61.530741,16.235381
2019-1487014,2019-02-11,000001,Vente,22000,9054,,MORNE MASSABIELLE,B257,97110,97120,Pointe-à-Pitre,971,,,97120000AO0263,,,,,,,,,,,,,0,,,,,S,sols,,,62,-61.531357,16.235056
2019-1487024,2019-02-12,000001,Vente,118800,8001,,RES MIQUEL,A136,97110,97120,Pointe-à-Pitre,971,,,97120000AC0125,,,27,3.9,,,,,,,,,1,3,Dépendance,,0,,,,,,-61.534052,16.246245
2019-1487024,2019-02-12,000001,Vente,118800,8001,,RES MIQUEL,A136,97110,97120,Pointe-à-Pitre,971,,,97120000AC0125,,,54,91.42,,,,,,,,,1,2,Appartement,96,6,,,,,,-61.534052,16.246245
2019-1487028,2019-01-23,000001,Vente,104000,34,,BD LEGITIMUS,0550,97110,97120,Pointe-à-Pitre,971,,,97120000AE0173,,,30,97.08,,,,,,,,,1,2,Appartement,94,5,,,,,,-61.534348,16.243414
2019-1487047,2019-02-18,000001,Vente,275000,73,,RUE BARBES,0110,97110,97120,Pointe-à-Pitre,971,,,97120000AH0331,,,1,,,,,,,,,,1,4,Local industriel. commercial ou assimilé,179,0,,,,,,-61.538295,16.239424
2019-1487050,2019-02-22,000001,Vente,140000,6,,RUE RASPAIL,0690,97110,97120,Pointe-à-Pitre,971,,,97120000AO0062,,,4,,,,,,,,,,1,2,Appartement,86,3,,,,,,-61.532633,16.234379
2019-1487050,2019-02-22,000001,Vente,140000,6,,RUE RASPAIL,0690,97110,97120,Pointe-à-Pitre,971,,,97120000AO0062,,,6,,,,,,,,,,1,3,Dépendance,,0,,,,,,-61.532633,16.234379
2019-1487051,2019-02-20,000001,Vente,70000,2,,RUE SCHOELCHER,0730,97110,97120,Pointe-à-Pitre,971,,,97120000AI0138,,,15,43.71,,,,,,,,,1,2,Appartement,47,2,,,,,,-61.537406,16.235799
2019-1487056,2019-02-19,000001,Vente,55000,9001,,BD FAIDHERBE,0360,97110,97120,Pointe-à-Pitre,971,,,97120000AD0054,,,36,62.32,,,,,,,,,1,2,Appartement,62,3,,,,,,-61.536533,16.24155
2019-1487096,2019-02-15,000001,Vente,77000,8002,,TOUR MIQUEL NORD 3,C108,97110,97120,Pointe-à-Pitre,971,,,97120000AD0035,,,35,,,,,,,,,,1,3,Dépendance,,0,,,,,,-61.534354,16.245731
2019-1487096,2019-02-15,000001,Vente,77000,8002,,TOUR MIQUEL NORD 3,C108,97110,97120,Pointe-à-Pitre,971,,,97120000AD0035,,,55,69.21,,,,,,,,,1,2,Appartement,79,4,,,,,,-61.534354,16.245731
2019-1487097,2019-02-22,000001,Vente,130000,1,B,FG FREBAULT,0400,97110,97120,Pointe-à-Pitre,971,,,97120000AE0373,,,12,,,,,,,,,,1,4,Local industriel. commercial ou assimilé,71,0,,,,,,-61.534837,16.241304
2019-1487099,2019-02-26,000001,Vente,80000,,,MASSABIELLE,B224,97110,97120,Pointe-à-Pitre,971,,,97120000AO0289,,,,,,,,,,,,,0,,,,,S,sols,,,48,-61.529998,16.235208
2019-1487101,2019-02-27,000001,Vente,29000,13,,RUE DUGOMMIER,0330,97110,97120,Pointe-à-Pitre,971,,,97120000AO0102,,,,,,,,,,,,,0,,,,,S,sols,,,57,-61.532946,16.23609
2019-1487105,2019-02-27,000001,Vente,79876,8,T,PL CAMILLE DESMOULINS,0160,97110,97120,Pointe-à-Pitre,971,,,97120000AO0095,,,,,,,,,,,,,0,,,,,AB,terrains a bâtir,,,141,-61.532874,16.23586
2019-1487115,2019-02-18,000001,Vente,650000,1,,LE MOLE PORTUAIRE,B240,97110,97120,Pointe-à-Pitre,971,,,97120000AS0018,,,7,139.92,,,,,,,,,1,2,Appartement,103,4,,,,,,-61.527739,16.218979
2019-1487115,2019-02-18,000001,Vente,650000,35,,LE MOLE PORTUAIRE,B240,97110,97120,Pointe-à-Pitre,971,,,97120000AS0018,,,76,,,,,,,,,,1,3,Dépendance,,0,,,,,,-61.527739,16.218979
2019-1487115,2019-02-18,000001,Vente,650000,35,,LE MOLE PORTUAIRE,B240,97110,97120,Pointe-à-Pitre,971,,,97120000AS0018,,,42,,,,,,,,,,1,3,Dépendance,,0,,,,,,-61.527739,16.218979
2019-1487126,2019-02-26,000001,Vente,94000,8001,,RES POINSETTIA BELAYE,A164,97110,97120,Pointe-à-Pitre,971,,,97120000AE0309,,,26,93.77,,,,,,,,,1,2,Appartement,96,5,,,,,,-61.53327,16.243066
2019-1487157,2019-03-01,000001,Vente,60000,8001,,RUE DES CITES UNIES,0200,97110,97120,Pointe-à-Pitre,971,,,97120000AE0051,,,10,,,,,,,,,,1,4,Local industriel. commercial ou assimilé,26,0,,,,,,-61.53195,16.241315
2019-1487157,2019-03-01,000001,Vente,60000,8001,,RUE DES CITES UNIES,0200,97110,97120,Pointe-à-Pitre,971,,,97120000AE0051,,,9,,,,,,,,,,1,4,Local industriel. commercial ou assimilé,20,0,,,,,,-61.53195,16.241315
2019-1487159,2019-03-01,000001,Vente,95000,14,B,QUAI LEFEBVRE,0540,97110,97120,Pointe-à-Pitre,971,,,97120000AH0334,,,1,88.1,,,,,,,,,1,4,Local industriel. commercial ou assimilé,110,0,,,,,,-61.538242,16.239593
2019-1487217,2019-03-20,000001,Vente,79000,8002,,RUE DES CITES UNIES,0200,97110,97120,Pointe-à-Pitre,971,,,97120000AE0051,,,16,69.41,,,,,,,,,1,2,Appartement,75,4,,,,,,-61.53195,16.241315
2019-1487222,2019-03-14,000001,Vente,104000,8001,,RES POINSETTIA HAMOT,A166,97110,97120,Pointe-à-Pitre,971,,,97120000AE0310,,,10,,,,,,,,,,1,2,Appartement,86,4,,,,,,-61.53319,16.242697
2019-1487244,2019-03-21,000001,Vente,115000,1,,RUE DELGRES,0228,97110,97120,Pointe-à-Pitre,971,,,97120000AK0176,,,13,,,,,,,,,,1,4,Local industriel. commercial ou assimilé,50,0,,,,,,-61.535975,16.23564
2019-1487274,2019-03-13,000001,Vente,115000,61,,RUE DE L ABBE GREGOIRE,0010,97110,97120,Pointe-à-Pitre,971,,,97120000AH0003,,,22,,,,,,,,,,1,3,Dépendance,,0,,,,,,-61.537905,16.240858
2019-1487274,2019-03-13,000001,Vente,115000,61,,RUE DE L ABBE GREGOIRE,0010,97110,97120,Pointe-à-Pitre,971,,,97120000AH0003,,,36,,,,,,,,,,1,3,Dépendance,,0,,,,,,-61.537905,16.240858
2019-1487285,2019-03-29,000001,Vente,100000,8001,,RUE FELIX EBOUE,0365,97110,97120,Pointe-à-Pitre,971,,,97120000AE0006,,,16,105.03,,,,,,,,,1,2,Appartement,85,5,,,,,,-61.533193,16.245498
2019-1487307,2019-03-25,000001,Vente,200000,16,,RUE FREBAULT,0410,97110,97120,Pointe-à-Pitre,971,,,97120000AK0023,,,2,,,,,,,,,,1,4,Local industriel. commercial ou assimilé,48,0,,,,,,-61.5367,16.236061
2019-1487307,2019-03-25,000001,Vente,200000,16,,RUE FREBAULT,0410,97110,97120,Pointe-à-Pitre,971,,,97120000AK0023,,,3,,,,,,,,,,1,4,Local industriel. commercial ou assimilé,97,0,,,,,,-61.5367,16.236061
2019-1487307,2019-03-25,000001,Vente,200000,16,,RUE FREBAULT,0410,97110,97120,Pointe-à-Pitre,971,,,97120000AK0023,,,1,,,,,,,,,,1,4,Local industriel. commercial ou assimilé,48,0,,,,,,-61.5367,16.236061
2019-1487320,2019-03-22,000001,Vente,435000,4,1,RUE BEBIAN,0130,97110,97120,Pointe-à-Pitre,971,,,97120000AL0289,,,,,,,,,,,,,0,4,Local industriel. commercial ou assimilé,274,0,AB,terrains a bâtir,,,169,-61.534585,16.237263
2019-1487320,2019-03-22,000001,Vente,435000,4,1,RUE BEBIAN,0130,97110,97120,Pointe-à-Pitre,971,,,97120000AL0289,,,,,,,,,,,,,0,2,Appartement,89,2,AB,terrains a bâtir,,,169,-61.534585,16.237263
2019-1487320,2019-03-22,000001,Vente,435000,4,1,RUE BEBIAN,0130,97110,97120,Pointe-à-Pitre,971,,,97120000AL0289,,,,,,,,,,,,,0,2,Appartement,61,2,AB,terrains a bâtir,,,169,-61.534585,16.237263
2019-1487320,2019-03-22,000001,Vente,435000,4,1,RUE BEBIAN,0130,97110,97120,Pointe-à-Pitre,971,,,97120000AL0289,,,,,,,,,,,,,0,2,Appartement,84,2,AB,terrains a bâtir,,,169,-61.534585,16.237263
2019-1487338,2019-04-05,000001,Vente,45000,,,MORTENOL,B022,97110,97120,Pointe-à-Pitre,971,,,97120000AN0223,,,34,,,,,,,,,,1,2,Appartement,44,3,,,,,,-61.530013,16.239369
2019-1487347,2019-04-12,000001,Vente,35000,86,,PL CAMILLE DESMOULINS,0160,97110,97120,Pointe-à-Pitre,971,,,97120000AO0086,,,,,,,,,,,,,0,,,,,S,sols,,,65,-61.533067,16.235493
2019-1487377,2019-04-12,000001,Vente,100000,52,,RUE DE NOZIERES,0617,97110,97120,Pointe-à-Pitre,971,,,97120000AH0496,,,,,,,,,,,,,0,2,Appartement,52,2,S,sols,,,112,-61.535455,16.238729
2019-1487377,2019-04-12,000001,Vente,100000,52,,RUE DE NOZIERES,0617,97110,97120,Pointe-à-Pitre,971,,,97120000AH0496,,,,,,,,,,,,,0,2,Appartement,53,2,S,sols,,,112,-61.535455,16.238729
2019-1487377,2019-04-12,000001,Vente,100000,52,,RUE DE NOZIERES,0617,97110,97120,Pointe-à-Pitre,971,,,97120000AH0496,,,,,,,,,,,,,0,4,Local industriel. commercial ou assimilé,58,0,S,sols,,,112,-61.535455,16.238729
2019-1487412,2019-04-17,000001,Vente,30000,9001,,BD FAIDHERBE,0360,97110,97120,Pointe-à-Pitre,971,,,97120000AD0054,,,111,73.02,,,,,,,,,1,2,Appartement,72,4,,,,,,-61.536533,16.24155
2019-1487441,2019-04-16,000001,Vente,100000,47,,RUE ACHILLE RENE BOISNEUF,0020,97110,97120,Pointe-à-Pitre,971,,,97120000AI0036,,,2,62.6,,,,,,,,,1,4,Local industriel. commercial ou assimilé,113,0,,,,,,-61.537673,16.23718
2019-1487441,2019-04-16,000001,Vente,100000,47,,RUE ACHILLE RENE BOISNEUF,0020,97110,97120,Pointe-à-Pitre,971,,,97120000AI0036,,,1,35.94,,,,,,,,,1,4,Local industriel. commercial ou assimilé,114,0,,,,,,-61.537673,16.23718
2019-1487469,2019-04-25,000001,Vente,20000,9001,,BD FAIDHERBE,0360,97110,97120,Pointe-à-Pitre,971,,,97120000AD0054,,,122,,,,,,,,,,1,2,Appartement,39,2,,,,,,-61.536533,16.24155
2019-1487485,2019-04-25,000001,Vente,60000,8001,,QUAI GATINE,0430,97110,97120,Pointe-à-Pitre,971,,,97120000AO0318,,,18,66.26,,,,,,,,,1,2,Appartement,65,3,,,,,,-61.533724,16.235604
2019-1487529,2019-04-18,000001,Vente,80000,97,,RUE DE NOZIERES,0617,97110,97120,Pointe-à-Pitre,971,,,97120000AM0016,,,,,,,,,,,,,0,4,Local industriel. commercial ou assimilé,120,0,S,sols,,,192,-61.53461,16.240103
2019-1487529,2019-04-18,000001,Vente,80000,97,,RUE DE NOZIERES,0617,97110,97120,Pointe-à-Pitre,971,,,97120000AM0016,,,,,,,,,,,,,0,1,Maison,57,4,S,sols,,,192,-61.53461,16.240103
2019-1487540,2019-05-03,000001,Vente,700000,92,,RUE FREBAULT,0410,97110,97120,Pointe-à-Pitre,971,,,97120000AH0183,,,,,,,,,,,,,0,4,Local industriel. commercial ou assimilé,140,0,S,sols,,,155,-61.535823,16.239659
2019-1487540,2019-05-03,000001,Vente,700000,92,,RUE FREBAULT,0410,97110,97120,Pointe-à-Pitre,971,,,97120000AH0183,,,,,,,,,,,,,0,2,Appartement,65,3,S,sols,,,155,-61.535823,16.239659
2019-1487540,2019-05-03,000001,Vente,700000,92,,RUE FREBAULT,0410,97110,97120,Pointe-à-Pitre,971,,,97120000AH0183,,,,,,,,,,,,,0,4,Local industriel. commercial ou assimilé,72,0,S,sols,,,155,-61.535823,16.239659
2019-1487552,2019-05-14,000001,Vente,65000,41,,CITE MIQUEL,A133,97110,97120,Pointe-à-Pitre,971,,,97120000AC0158,,,42,,,,,,,,,,1,2,Appartement,57,3,,,,,,-61.534446,16.246317
2019-1487596,2019-05-17,000001,Vente,23000,49,B,FG ALEXANDRE ISAAC,0040,97110,97120,Pointe-à-Pitre,971,,,97120000AN0080,,,,,,,,,,,,,0,1,Maison,47,3,S,sols,,,44,-61.530231,16.236475
2019-1487635,2019-05-22,000001,Vente,7500,8005,,RES LE MOULIN DE BAS DU FORT,A153,97110,97120,Pointe-à-Pitre,971,,,97120000AS0156,,,118,,,,,,,,,,1,3,Dépendance,,0,,,,,,-61.528767,16.219831
2019-1487643,2019-05-21,000001,Vente,180000,32,B,RUE DE L ABBE GREGOIRE,0010,97110,97120,Pointe-à-Pitre,971,,,97120000AH0505,,,,,,,,,,,,,0,2,Appartement,25,2,S,sols,,,71,-61.53688,16.240309
2019-1487643,2019-05-21,000001,Vente,180000,32,B,RUE DE L ABBE GREGOIRE,0010,97110,97120,Pointe-à-Pitre,971,,,97120000AH0505,,,,,,,,,,,,,0,2,Appartement,50,2,S,sols,,,71,-61.53688,16.240309
2019-1487643,2019-05-21,000001,Vente,180000,32,B,RUE DE L ABBE GREGOIRE,0010,97110,97120,Pointe-à-Pitre,971,,,97120000AH0505,,,,,,,,,,,,,0,4,Local industriel. commercial ou assimilé,55,0,S,sols,,,71,-61.53688,16.240309
2019-1487643,2019-05-21,000001,Vente,180000,32,B,RUE DE L ABBE GREGOIRE,0010,97110,97120,Pointe-à-Pitre,971,,,97120000AH0505,,,,,,,,,,,,,0,2,Appartement,25,2,S,sols,,,71,-61.53688,16.240309
2019-1487689,2019-06-07,000001,Vente,33000,9001,,BD FAIDHERBE,0360,97110,97120,Pointe-à-Pitre,971,,,97120000AD0054,,,120,72.57,,,,,,,,,1,2,Appartement,72,4,,,,,,-61.536533,16.24155
2019-1487700,2019-06-07,000001,Vente,70000,73,,RUE JEAN JAURES,0496,97110,97120,Pointe-à-Pitre,971,,,97120000AH0248,,,4,77.63,,,,,,,,,1,2,Appartement,80,4,,,,,,-61.536538,16.240026
2019-1487705,2019-06-14,000001,Vente,262396.34,22,,LE MOLE PORTUAIRE,B240,97110,97120,Pointe-à-Pitre,971,,,97120000AS0027,,,75,,,,,,,,,,1,2,Appartement,40,2,,,,,,-61.528887,16.220217
2019-1487721,2019-05-31,000001,Vente,64500,8001,,RES POINSETTIA BELAYE,A164,97110,97120,Pointe-à-Pitre,971,,,97120000AE0309,,,27,57.46,,,,,,,,,1,2,Appartement,63,3,,,,,,-61.53327,16.243066
2019-1487737,2019-06-17,000001,Vente,100000,38,,RUE GILBERT DE CHAMBERTRAND,0438,97110,97120,Pointe-à-Pitre,971,,,97120000AM0309,,,,,,,,,,,,,0,4,Local industriel. commercial ou assimilé,143,0,S,sols,,,191,-61.532577,16.238384
2019-1487757,2019-06-14,000001,Vente,35000,8009,,RES CIBONEYE,A042,97110,97120,Pointe-à-Pitre,971,,,97120000AB0157,,,38,,,,,,,,,,1,4,Local industriel. commercial ou assimilé,38,0,,,,,,-61.543369,16.246812
2019-1487927,2019-07-05,000001,Vente,70000,8001,,TOUR MIQUEL NORD 3,C108,97110,97120,Pointe-à-Pitre,971,,,97120000AD0035,,,9,,,,,,,,,,1,3,Dépendance,,0,,,,,,-61.534354,16.245731
2019-1487927,2019-07-05,000001,Vente,70000,8001,,TOUR MIQUEL NORD 3,C108,97110,97120,Pointe-à-Pitre,971,,,97120000AD0035,,,23,60.32,,,,,,,,,1,2,Appartement,68,3,,,,,,-61.534354,16.245731
2019-1487974,2019-07-12,000001,Vente,100000,116,B,RUE FREBAULT,0410,97110,97120,Pointe-à-Pitre,971,,,97120000AH0098,,,,,,,,,,,,,0,4,Local industriel. commercial ou assimilé,245,0,S,sols,,,287,-61.535637,16.240596
2019-1487974,2019-07-12,000001,Vente,100000,116,B,RUE FREBAULT,0410,97110,97120,Pointe-à-Pitre,971,,,97120000AH0098,,,,,,,,,,,,,0,4,Local industriel. commercial ou assimilé,166,0,S,sols,,,287,-61.535637,16.240596
2019-1487974,2019-07-12,000001,Vente,100000,116,B,RUE FREBAULT,0410,97110,97120,Pointe-à-Pitre,971,,,97120000AH0098,,,,,,,,,,,,,0,2,Appartement,112,4,S,sols,,,287,-61.535637,16.240596
2019-1487974,2019-07-12,000001,Vente,100000,116,B,RUE FREBAULT,0410,97110,97120,Pointe-à-Pitre,971,,,97120000AH0098,,,,,,,,,,,,,0,2,Appartement,40,2,S,sols,,,287,-61.535637,16.240596
2019-1488008,2019-07-09,000001,Vente,30000,9001,,BD FAIDHERBE,0360,97110,97120,Pointe-à-Pitre,971,,,97120000AD0054,,,134,,,,,,,,,,1,2,Appartement,84,5,,,,,,-61.536533,16.24155
2019-1488046,2019-07-10,000001,Vente,145000,69,,LE MOLE PORTUAIRE,B240,97110,97120,Pointe-à-Pitre,971,,,97120000AS0027,,,70,40.64,,,,,,,,,1,2,Appartement,43,2,,,,,,-61.528887,16.220217
2019-1488074,2019-08-02,000001,Vente,89000,25,,RUE DU GEN RHUILLIER,0437,97110,97120,Pointe-à-Pitre,971,,,97120000AM0377,,,4,107.86,,,,,,,,,1,2,Appartement,78,3,,,,,,-61.533956,16.239116
2019-1488094,2019-07-19,000001,Vente,46000,37,,RUE DE NOZIERES,0617,97110,97120,Pointe-à-Pitre,971,,,97120000AL0339,,,,,,,,,,,,,0,4,Local industriel. commercial ou assimilé,25,0,S,sols,,,48,-61.535374,16.238177
2019-1488094,2019-07-19,000001,Vente,46000,37,,RUE DE NOZIERES,0617,97110,97120,Pointe-à-Pitre,971,,,97120000AL0339,,,,,,,,,,,,,0,2,Appartement,82,3,S,sols,,,48,-61.535374,16.238177
2019-1488094,2019-07-19,000001,Vente,46000,37,,RUE DE NOZIERES,0617,97110,97120,Pointe-à-Pitre,971,,,97120000AL0339,,,,,,,,,,,,,0,4,Local industriel. commercial ou assimilé,18,0,S,sols,,,48,-61.535374,16.238177
2019-1488104,2019-08-01,000001,Vente,45000,,,RUE DE L ABBE GREGOIRE,0010,97110,97120,Pointe-à-Pitre,971,,,97120000AH0262,,,,,,,,,,,,,0,1,Maison,50,3,S,sols,,,50,-61.536931,16.240306
2019-1488104,2019-08-01,000001,Vente,45000,,,RUE DE L ABBE GREGOIRE,0010,97110,97120,Pointe-à-Pitre,971,,,97120000AH0262,,,,,,,,,,,,,0,4,Local industriel. commercial ou assimilé,40,0,S,sols,,,50,-61.536931,16.240306
2019-1488105,2019-08-02,000001,Vente,30000,8001,,RES ESPACE 2000,A053,97110,97120,Pointe-à-Pitre,971,,,97120000AD0053,,,47,73.21,,,,,,,,,1,2,Appartement,72,4,,,,,,-61.536963,16.241723
2019-1488113,2019-07-30,000001,Vente,1800000,115,,RUE FREBAULT,0410,97110,97120,Pointe-à-Pitre,971,,,97120000AH0114,,,,,,,,,,,,,0,4,Local industriel. commercial ou assimilé,2261,0,S,sols,,,1359,-61.535011,16.240393
2019-1488143,2019-08-08,000001,Vente,18289.62,8001,,FG FREBAULT,0400,97110,97120,Pointe-à-Pitre,971,,,97120000AD0042,,,13,,,,,,,,,,1,2,Appartement,61,4,,,,,,-61.535043,16.243313
2019-1488156,2019-08-05,000001,Vente,1000000,9003,,RUE NEIL ARMSTRONG,0613,97110,97120,Pointe-à-Pitre,971,,,97120000AC0011,,,,,,,,,,,,,0,4,Local industriel. commercial ou assimilé,33,0,S,sols,,,1576,-61.54158,16.247717
2019-1488156,2019-08-05,000001,Vente,1000000,9003,,RUE NEIL ARMSTRONG,0613,97110,97120,Pointe-à-Pitre,971,,,97120000AC0011,,,,,,,,,,,,,0,4,Local industriel. commercial ou assimilé,65,0,S,sols,,,1576,-61.54158,16.247717
2019-1488156,2019-08-05,000001,Vente,1000000,9003,,RUE NEIL ARMSTRONG,0613,97110,97120,Pointe-à-Pitre,971,,,97120000AC0011,,,,,,,,,,,,,0,4,Local industriel. commercial ou assimilé,32,0,S,sols,,,1576,-61.54158,16.247717
2019-1488156,2019-08-05,000001,Vente,1000000,9003,,RUE NEIL ARMSTRONG,0613,97110,97120,Pointe-à-Pitre,971,,,97120000AC0011,,,,,,,,,,,,,0,3,Dépendance,,0,S,sols,,,1576,-61.54158,16.247717
2019-1488156,2019-08-05,000001,Vente,1000000,9003,,RUE NEIL ARMSTRONG,0613,97110,97120,Pointe-à-Pitre,971,,,97120000AC0011,,,,,,,,,,,,,0,3,Dépendance,,0,S,sols,,,1576,-61.54158,16.247717
2019-1488156,2019-08-05,000001,Vente,1000000,9003,,RUE NEIL ARMSTRONG,0613,97110,97120,Pointe-à-Pitre,971,,,97120000AC0011,,,,,,,,,,,,,0,3,Dépendance,,0,S,sols,,,1576,-61.54158,16.247717
2019-1488156,2019-08-05,000001,Vente,1000000,9003,,RUE NEIL ARMSTRONG,0613,97110,97120,Pointe-à-Pitre,971,,,97120000AC0011,,,,,,,,,,,,,0,3,Dépendance,,0,S,sols,,,1576,-61.54158,16.247717
2019-1488156,2019-08-05,000001,Vente,1000000,9003,,RUE NEIL ARMSTRONG,0613,97110,97120,Pointe-à-Pitre,971,,,97120000AC0011,,,,,,,,,,,,,0,3,Dépendance,,0,S,sols,,,1576,-61.54158,16.247717
2019-1488156,2019-08-05,000001,Vente,1000000,9003,,RUE NEIL ARMSTRONG,0613,97110,97120,Pointe-à-Pitre,971,,,97120000AC0011,,,,,,,,,,,,,0,3,Dépendance,,0,S,sols,,,1576,-61.54158,16.247717
2019-1488156,2019-08-05,000001,Vente,1000000,9003,,RUE NEIL ARMSTRONG,0613,97110,97120,Pointe-à-Pitre,971,,,97120000AC0011,,,,,,,,,,,,,0,3,Dépendance,,0,S,sols,,,1576,-61.54158,16.247717
2019-1488156,2019-08-05,000001,Vente,1000000,9003,,RUE NEIL ARMSTRONG,0613,97110,97120,Pointe-à-Pitre,971,,,97120000AC0011,,,,,,,,,,,,,0,4,Local industriel. commercial ou assimilé,35,0,S,sols,,,1576,-61.54158,16.247717
2019-1488156,2019-08-05,000001,Vente,1000000,9003,,RUE NEIL ARMSTRONG,0613,97110,97120,Pointe-à-Pitre,971,,,97120000AC0011,,,,,,,,,,,,,0,3,Dépendance,,0,S,sols,,,1576,-61.54158,16.247717
2019-1488156,2019-08-05,000001,Vente,1000000,9003,,RUE NEIL ARMSTRONG,0613,97110,97120,Pointe-à-Pitre,971,,,97120000AC0011,,,,,,,,,,,,,0,3,Dépendance,,0,S,sols,,,1576,-61.54158,16.247717
2019-1488156,2019-08-05,000001,Vente,1000000,9003,,RUE NEIL ARMSTRONG,0613,97110,97120,Pointe-à-Pitre,971,,,97120000AC0011,,,,,,,,,,,,,0,4,Local industriel. commercial ou assimilé,45,0,S,sols,,,1576,-61.54158,16.247717
2019-1488156,2019-08-05,000001,Vente,1000000,9003,,RUE NEIL ARMSTRONG,0613,97110,97120,Pointe-à-Pitre,971,,,97120000AC0011,,,,,,,,,,,,,0,4,Local industriel. commercial ou assimilé,59,0,S,sols,,,1576,-61.54158,16.247717
2019-1488156,2019-08-05,000001,Vente,1000000,9003,,RUE NEIL ARMSTRONG,0613,97110,97120,Pointe-à-Pitre,971,,,97120000AC0011,,,,,,,,,,,,,0,4,Local industriel. commercial ou assimilé,35,0,S,sols,,,1576,-61.54158,16.247717
2019-1488156,2019-08-05,000001,Vente,1000000,9003,,RUE NEIL ARMSTRONG,0613,97110,97120,Pointe-à-Pitre,971,,,97120000AC0011,,,,,,,,,,,,,0,4,Local industriel. commercial ou assimilé,42,0,S,sols,,,1576,-61.54158,16.247717
2019-1488156,2019-08-05,000001,Vente,1000000,9003,,RUE NEIL ARMSTRONG,0613,97110,97120,Pointe-à-Pitre,971,,,97120000AC0011,,,,,,,,,,,,,0,4,Local industriel. commercial ou assimilé,42,0,S,sols,,,1576,-61.54158,16.247717
2019-1488167,2019-08-08,000001,Vente,75000,8001,,FG FREBAULT,0400,97110,97120,Pointe-à-Pitre,971,,,97120000AD0042,,,13,,,,,,,,,,1,2,Appartement,61,4,,,,,,-61.535043,16.243313
2019-1488200,2019-08-07,000001,Vente,42000,8001,,RES MIQUEL,A136,97110,97120,Pointe-à-Pitre,971,,,97120000AC0125,,,56,,,,,,,,,,1,2,Appartement,69,4,,,,,,-61.534052,16.246245
2019-1488214,2019-08-08,000001,Vente,60000,8005,,LE MOLE PORTUAIRE,B240,97110,97120,Pointe-à-Pitre,971,,,97120000AS0041,,,8,59.49,,,,,,,,,1,4,Local industriel. commercial ou assimilé,72,0,,,,,,-61.527542,16.219576
2019-1488226,2019-08-07,000001,Vente,68000,6,,RUE DE NASSAU,0610,97110,97120,Pointe-à-Pitre,971,,,97120000AH0356,,,3,47.45,,,,,,,,,1,2,Appartement,49,2,,,,,,-61.537779,16.239449
2019-1488236,2019-08-08,000001,Vente,65000,6,,PL CAMILLE DESMOULINS,0160,97110,97120,Pointe-à-Pitre,971,,,97120000AO0098,,,,,,,,,,,,,0,1,Maison,100,7,S,sols,,,137,-61.53291,16.235995
2019-1488237,2019-07-30,000001,Vente,20000,14,,RUE VICTOR HUGO,0780,97110,97120,Pointe-à-Pitre,971,,,97120000AL0226,,,,,,,,,,,,,0,4,Local industriel. commercial ou assimilé,29,0,S,sols,,,39,-61.532683,16.237117