id_mutation,date_mutation,numero_disposition,nature_mutation,valeur_fonciere,adresse_numero,adresse_suffixe,adresse_nom_voie,adresse_code_voie,code_postal,code_commune,nom_commune,code_departement,ancien_code_commune,ancien_nom_commune,id_parcelle,ancien_id_parcelle,numero_volume,lot1_numero,lot1_surface_carrez,lot2_numero,lot2_surface_carrez,lot3_numero,lot3_surface_carrez,lot4_numero,lot4_surface_carrez,lot5_numero,lot5_surface_carrez,nombre_lots,code_type_local,type_local,surface_reelle_bati,nombre_pieces_principales,code_nature_culture,nature_culture,code_nature_culture_speciale,nature_culture_speciale,surface_terrain,longitude,latitude
2019-1492505,2019-01-02,000001,Vente,938,,,ILE DU GALLION,B020,97356,97313,Montsinéry-Tonnegrande,973,,,97313000AK0131,,,,,,,,,,,,,0,,,,,L,landes,,,13114,-52.393442,4.776465
2019-1492506,2019-01-08,000001,Vente,15000,,,BANANE,B001,97356,97313,Montsinéry-Tonnegrande,973,,,97313000AV0309,,,,,,,,,,,,,0,,,,,L,landes,,,5000,-52.541877,4.862467
2019-1492519,2019-01-18,000001,Vente,27500,,,BASSE TERRE SUD,B003,97356,97313,Montsinéry-Tonnegrande,973,,,97313000AS0139,,,,,,,,,,,,,0,,,,,L,landes,,,5000,-52.474197,4.834751
2019-1492523,2019-01-09,000001,Vente,43810,,,LE SOLITAIRE SUD,B038,97356,97313,Montsinéry-Tonnegrande,973,,,97313000AP0165,,,,,,,,,,,,,0,,,,,L,landes,,,13958,-52.447225,4.789625
2019-1492535,2019-01-25,000001,Vente,16000,,,ILE DU GALLION,B020,97356,97313,Montsinéry-Tonnegrande,973,,,97313000AK0180,,,,,,,,,,,,,0,,,,,L,landes,,,1619,-52.400121,4.772711
2019-1492631,2019-02-18,000001,Vente,9000,,,BANANE,B001,97356,97313,Montsinéry-Tonnegrande,973,,,97313000AV0305,,,,,,,,,,,,,0,,,,,L,landes,,,1000,-52.53158,4.871495
2019-1492679,2019-02-20,000001,Vente,35000,,,LA BAUME,B004,97356,97313,Montsinéry-Tonnegrande,973,,,97313000AI0335,,,,,,,,,,,,,0,,,,,L,landes,,,2000,-52.390488,4.799264
2019-1492679,2019-02-20,000001,Vente,35000,,,LA BAUME,B004,97356,97313,Montsinéry-Tonnegrande,973,,,97313000AI0362,,,,,,,,,,,,,0,,,,,L,landes,,,37680,-52.390361,4.799511
2019-1492684,2019-02-20,000001,Vente,30000,,,LA BAUME,B004,97356,97313,Montsinéry-Tonnegrande,973,,,97313000AI0217,,,,,,,,,,,,,0,,,,,L,landes,,,12208,-52.383984,4.794263
2019-1492684,2019-02-20,000001,Vente,30000,,,LA BAUME,B004,97356,97313,Montsinéry-Tonnegrande,973,,,97313000AI0218,,,,,,,,,,,,,0,,,,,L,landes,,,41,-52.386001,4.795038
2019-1492684,2019-02-20,000001,Vente,30000,,,LA BAUME,B004,97356,97313,Montsinéry-Tonnegrande,973,,,97313000AI0281,,,,,,,,,,,,,0,,,,,L,landes,,,1639,-52.383684,4.795333
2019-1492684,2019-02-20,000001,Vente,30000,,,LA BAUME,B004,97356,97313,Montsinéry-Tonnegrande,973,,,97313000AI0287,,,,,,,,,,,,,0,,,,,L,landes,,,2951,-52.383408,4.793763
2019-1492684,2019-02-20,000001,Vente,30000,,,LA BAUME,B004,97356,97313,Montsinéry-Tonnegrande,973,,,97313000AI0290,,,,,,,,,,,,,0,,,,,L,landes,,,2217,-52.383239,4.792808
2019-1492684,2019-02-20,000001,Vente,30000,,,LA BAUME,B004,97356,97313,Montsinéry-Tonnegrande,973,,,97313000AI0371,,,,,,,,,,,,,0,,,,,L,landes,,,104,-52.383367,4.795391
2019-1492735,2019-03-20,000001,Vente,16000,,,ILE DU GALLION,B020,97356,97313,Montsinéry-Tonnegrande,973,,,97313000AK0188,,,,,,,,,,,,,0,,,,,L,landes,,,2054,-52.398806,4.772665
2019-1492752,2019-03-11,000001,Vente,19000,,,GIGOGNE,B015,97356,97313,Montsinéry-Tonnegrande,973,,,97313000AR0214,,,,,,,,,,,,,0,,,,,L,landes,,,5000,-52.473499,4.798303
2019-1492753,2019-02-18,000001,Vente,10000,,,BANANE,B001,97356,97313,Montsinéry-Tonnegrande,973,,,97313000AV0306,,,,,,,,,,,,,0,,,,,L,landes,,,1000,-52.5314,4.871629
2019-1492791,2019-03-15,000001,Vente,60000,,,QUESNEL OUEST,B030,97356,97313,Montsinéry-Tonnegrande,973,,,97313000BC0094,,,,,,,,,,,,,0,,,,,L,landes,,,20000,-52.517109,4.937059
2019-1492801,2019-04-03,000001,Vente,3222,,,MONTEVIDEO,B024,97356,97313,Montsinéry-Tonnegrande,973,,,97313000AS0094,,,,,,,,,,,,,0,,,,,L,landes,,,10739,-52.480417,4.826968
2019-1492806,2019-04-02,000001,Vente,35000,,,LE SOLITAIRE NORD,B037,97356,97313,Montsinéry-Tonnegrande,973,,,97313000AN0085,,,,,,,,,,,,,0,,,,,L,landes,,,8648,-52.428282,4.803241
2019-1492806,2019-04-02,000001,Vente,35000,,,LE SOLITAIRE NORD,B037,97356,97313,Montsinéry-Tonnegrande,973,,,97313000AN0085,,,,,,,,,,,,,0,,,,,L,landes,,,4047,-52.428282,4.803241
2019-1492813,2019-03-22,000001,Vente,19000,,,GIGOGNE,B015,97356,97313,Montsinéry-Tonnegrande,973,,,97313000AR0215,,,,,,,,,,,,,0,,,,,L,landes,,,5000,-52.473949,4.797554
2019-1492871,2019-04-17,000001,Vente,75000,,,DUMAINE,B010,97356,97313,Montsinéry-Tonnegrande,973,,,97313000AY0565,,,,,,,,,,,,,0,,,,,AB,terrains a bâtir,,,5511,-52.459146,4.927352
2019-1492890,2019-04-23,000001,Vente,1125,,,ILE DU GALLION,B020,97356,97313,Montsinéry-Tonnegrande,973,,,97313000AK0161,,,,,,,,,,,,,0,,,,,L,landes,,,13000,-52.395471,4.780597
2019-1492904,2019-04-17,000001,Vente,8000,,,PORT ININI SUD,B028,97356,97313,Montsinéry-Tonnegrande,973,,,97313000AR0199,,,,,,,,,,,,,0,,,,,L,landes,,,10000,-52.482697,4.811337
2019-1492913,2019-04-26,000001,Vente,256900,,,PORT ININI SUD,B028,97356,97313,Montsinéry-Tonnegrande,973,,,97313000AR0070,,,,,,,,,,,,,0,,,,,S,sols,,,1509,-52.485557,4.80841
2019-1492913,2019-04-26,000001,Vente,256900,8733,,RTE DU GALION,0033,97356,97313,Montsinéry-Tonnegrande,973,,,97313000AR0143,,,,,,,,,,,,,0,1,Maison,44,2,L,landes,,,6922,-52.485019,4.808195
2019-1492913,2019-04-26,000001,Vente,256900,8733,,RTE DU GALION,0033,97356,97313,Montsinéry-Tonnegrande,973,,,97313000AR0143,,,,,,,,,,,,,0,1,Maison,44,2,S,sols,,,1500,-52.485019,4.808195
2019-1492953,2019-04-25,000001,Vente,10000,,,DUMAINE,B010,97356,97313,Montsinéry-Tonnegrande,973,,,97313000AY0570,,,,,,,,,,,,,0,,,,,AB,terrains a bâtir,,,950,-52.449965,4.942553
2019-1492953,2019-04-25,000001,Vente,10000,,,DUMAINE,B010,97356,97313,Montsinéry-Tonnegrande,973,,,97313000AY0571,,,,,,,,,,,,,0,,,,,AB,terrains a bâtir,,,198,-52.450065,4.942418
2019-1492980,2019-04-29,000001,Vente,18750,,,DUMAINE,B010,97356,97313,Montsinéry-Tonnegrande,973,,,97313000AY0538,,,,,,,,,,,,,0,,,,,L,landes,,,7501,-52.46931,4.95686
2019-1493001,2019-05-23,000001,Vente,8000,,,PORT ININI SUD,B028,97356,97313,Montsinéry-Tonnegrande,973,,,97313000AR0188,,,,,,,,,,,,,0,,,,,L,landes,,,10000,-52.481602,4.808361
2019-1493016,2019-05-29,000001,Vente,10000,9009,,RISQUETOUT OUEST,B032,97356,97313,Montsinéry-Tonnegrande,973,,,97313000BE0124,,,,,,,,,,,,,0,1,Maison,19,1,S,sols,,,1000,-52.48481,4.781913
2019-1493016,2019-05-29,000001,Vente,10000,9009,,RISQUETOUT OUEST,B032,97356,97313,Montsinéry-Tonnegrande,973,,,97313000BE0124,,,,,,,,,,,,,0,1,Maison,19,1,L,landes,,,556633,-52.48481,4.781913
2019-1493016,2019-05-29,000001,Vente,10000,,,LES HAUTS DE MONTSINERY,B018,97356,97313,Montsinéry-Tonnegrande,973,,,97313000BE0736,,,,,,,,,,,,,0,,,,,L,landes,,,687708,-52.473224,4.789101
2019-1493020,2019-05-17,000001,Vente,394160,,,QUESNEL OUEST,B030,97356,97313,Montsinéry-Tonnegrande,973,,,97313000BC0111,,,,,,,,,,,,,0,,,,,T,terres,,,72093,-52.49934,4.948051
2019-1493021,2019-05-17,000001,Vente,42451.18,,,QUESNEL OUEST,B030,97356,97313,Montsinéry-Tonnegrande,973,,,97313000BC0110,,,,,,,,,,,,,0,,,,,T,terres,,,8881,-52.499111,4.949223
2019-1493052,2019-05-14,000001,Vente,35000,,,DUMAINE,B010,97356,97313,Montsinéry-Tonnegrande,973,,,97313000AY0530,,,,,,,,,,,,,0,,,,,T,terres,,,2000,-52.448188,4.943175
2019-1493059,2019-06-04,000001,Vente,1142,9018,,DEUX FLOTS,B009,97356,97313,Montsinéry-Tonnegrande,973,,,97313000AK0075,,,,,,,,,,,,,0,1,Maison,100,1,L,landes,,,15975,-52.394086,4.779891
2019-1493064,2019-06-04,000001,Vente,57000,,,COCO,B008,97356,97313,Montsinéry-Tonnegrande,973,,,97313000AV0250,,,,,,,,,,,,,0,,,,,L,landes,,,5000,-52.519995,4.855722
2019-1493078,2019-06-05,000001,Vente,350000,,,CIGOGNE,B058,97356,97313,Montsinéry-Tonnegrande,973,,,97313000AR0162,,,,,,,,,,,,,0,1,Maison,121,5,L,landes,,,8039,-52.471465,4.800299
2019-1493078,2019-06-05,000001,Vente,350000,,,CIGOGNE,B058,97356,97313,Montsinéry-Tonnegrande,973,,,97313000AR0162,,,,,,,,,,,,,0,1,Maison,39,3,S,sols,,,1000,-52.471465,4.800299
2019-1493078,2019-06-05,000001,Vente,350000,,,CIGOGNE,B058,97356,97313,Montsinéry-Tonnegrande,973,,,97313000AR0162,,,,,,,,,,,,,0,1,Maison,121,5,S,sols,,,1000,-52.471465,4.800299
2019-1493078,2019-06-05,000001,Vente,350000,,,CIGOGNE,B058,97356,97313,Montsinéry-Tonnegrande,973,,,97313000AR0162,,,,,,,,,,,,,0,1,Maison,39,3,L,landes,,,8039,-52.471465,4.800299
2019-1493175,2019-07-03,000001,Vente,40000,,,RISQUETOUT OUEST,B032,97356,97313,Montsinéry-Tonnegrande,973,,,97313000BD0228,,,,,,,,,,,,,0,,,,,L,landes,,,7339,-52.530462,4.921546
2019-1493175,2019-07-03,000001,Vente,40000,,,RISQUETOUT OUEST,B032,97356,97313,Montsinéry-Tonnegrande,973,,,97313000BD0249,,,,,,,,,,,,,0,,,,,L,landes,,,10000,-52.528185,4.921237
2019-1493175,2019-07-03,000001,Vente,40000,,,RISQUETOUT OUEST,B032,97356,97313,Montsinéry-Tonnegrande,973,,,97313000BD0251,,,,,,,,,,,,,0,,,,,L,landes,,,3463,-52.529031,4.921816
2019-1493190,2019-07-03,000001,Vente,20000,,,DUMAINE,B010,97356,97313,Montsinéry-Tonnegrande,973,,,97313000AY0567,,,,,,,,,,,,,0,,,,,AB,terrains a bâtir,,,950,-52.450018,4.94228
2019-1493190,2019-07-03,000001,Vente,20000,,,DUMAINE,B010,97356,97313,Montsinéry-Tonnegrande,973,,,97313000AY0568,,,,,,,,,,,,,0,,,,,AB,terrains a bâtir,,,950,-52.45032,4.942264
2019-1493190,2019-07-03,000001,Vente,20000,,,DUMAINE,B010,97356,97313,Montsinéry-Tonnegrande,973,,,97313000AY0571,,,,,,,,,,,,,0,,,,,AB,terrains a bâtir,,,198,-52.450065,4.942418
2019-1493250,2019-07-05,000001,Vente,53000,,,LA BAUME,B004,97356,97313,Montsinéry-Tonnegrande,973,,,97313000AI0217,,,,,,,,,,,,,0,,,,,L,landes,,,12208,-52.383984,4.794263
2019-1493250,2019-07-05,000001,Vente,53000,,,LA BAUME,B004,97356,97313,Montsinéry-Tonnegrande,973,,,97313000AI0218,,,,,,,,,,,,,0,,,,,L,landes,,,41,-52.386001,4.795038
2019-1493250,2019-07-05,000001,Vente,53000,,,LA BAUME,B004,97356,97313,Montsinéry-Tonnegrande,973,,,97313000AI0281,,,,,,,,,,,,,0,,,,,L,landes,,,1639,-52.383684,4.795333
2019-1493250,2019-07-05,000001,Vente,53000,,,LA BAUME,B004,97356,97313,Montsinéry-Tonnegrande,973,,,97313000AI0290,,,,,,,,,,,,,0,,,,,L,landes,,,2217,-52.383239,4.792808
2019-1493250,2019-07-05,000001,Vente,53000,,,LA BAUME,B004,97356,97313,Montsinéry-Tonnegrande,973,,,97313000AI0304,,,,,,,,,,,,,0,,,,,L,landes,,,2999,-52.384589,4.79329
2019-1493250,2019-07-05,000001,Vente,53000,,,LA BAUME,B004,97356,97313,Montsinéry-Tonnegrande,973,,,97313000AI0371,,,,,,,,,,,,,0,,,,,L,landes,,,104,-52.383367,4.795391
2019-1493270,2019-07-24,000001,Vente,20000,9000,,CD 5,0016,97356,97313,Montsinéry-Tonnegrande,973,,,97313000AN0311,,,,,,,,,,,,,0,1,Maison,57,2,T,terres,,,2000,-52.427824,4.785012
2019-1493270,2019-07-24,000001,Vente,20000,,,BEAUSEJOUR,B006,97356,97313,Montsinéry-Tonnegrande,973,,,97313000AN0336,,,,,,,,,,,,,0,,,,,S,sols,,,4483,-52.428351,4.783467
2019-1493320,2019-07-16,000001,Vente,22500,,,DUMAINE,B010,97356,97313,Montsinéry-Tonnegrande,973,,,97313000AY0538,,,,,,,,,,,,,0,,,,,L,landes,,,7501,-52.46931,4.95686
2019-1493335,2019-08-07,000001,Vente,32400,,,SAVANES DE MONTSINERY,B035,97356,97313,Montsinéry-Tonnegrande,973,,,97313000AX0265,,,,,,,,,,,,,0,,,,,AB,terrains a bâtir,,,673,-52.498508,4.891337
2019-1493343,2019-08-02,000001,Vente,150000,1700,,RTE DE MONTSINERY,0057,97356,97313,Montsinéry-Tonnegrande,973,,,97313000AV0311,,,,,,,,,,,,,0,1,Maison,65,3,L,landes,,,10000,-52.520417,4.858462
2019-1493438,2019-08-09,000002,Vente,158000,,,DUMAINE,B010,97356,97313,Montsinéry-Tonnegrande,973,,,97313000AY0563,,,,,,,,,,,,,0,,,,,L,landes,,,7500,-52.460587,4.941827
2019-1493459,2019-08-13,000001,Vente,20000,,,DUMAINE,B010,97356,97313,Montsinéry-Tonnegrande,973,,,97313000AY0577,,,,,,,,,,,,,0,,,,,AB,terrains a bâtir,,,1000,-52.449586,4.942862
2019-1493459,2019-08-13,000001,Vente,20000,,,DUMAINE,B010,97356,97313,Montsinéry-Tonnegrande,973,,,97313000AY0578,,,,,,,,,,,,,0,,,,,AB,terrains a bâtir,,,1000,-52.449658,4.942416
2019-1493485,2019-08-21,000001,Vente,34000,,,BASSE TERRE SUD,B003,97356,97313,Montsinéry-Tonnegrande,973,,,97313000AS0140,,,,,,,,,,,,,0,,,,,L,landes,,,5000,-52.47407,4.834121
2019-1493486,2019-08-19,000001,Vente,59000,,,DUMAINE,B010,97356,97313,Montsinéry-Tonnegrande,973,,,97313000AY0564,,,,,,,,,,,,,0,,,,,L,landes,,,2500,-52.461029,4.941827
2019-1493492,2019-09-11,000001,Vente,20000,,,BANANE,B001,97356,97313,Montsinéry-Tonnegrande,973,,,97313000AV0111,,,,,,,,,,,,,0,,,,,L,landes,,,19983,-52.524271,4.87409
2019-1493514,2019-09-17,000001,Vente,50000,490,-,CHEM DU POTIER,0130,,97313,Montsinéry-Tonnegrande,973,,,97313000AY0469,,,,,,,,,,,,,0,1,Maison,115,4,P,prés,,,1800,-52.463166,4.928106
2019-1493514,2019-09-17,000001,Vente,50000,,,GRENOUILLET,B017,97356,97313,Montsinéry-Tonnegrande,973,,,97313000AY0594,,,,,,,,,,,,,0,,,,,P,prés,,,663,-52.463352,4.928588
2019-1493514,2019-09-17,000001,Vente,50000,,,GRENOUILLET,B017,97356,97313,Montsinéry-Tonnegrande,973,,,97313000AY0595,,,,,,,,,,,,,0,,,,,P,prés,,,911,-52.463214,4.928401
2019-1493514,2019-09-17,000001,Vente,50000,,,DUMAINE,B010,97356,97313,Montsinéry-Tonnegrande,973,,,97313000AY0596,,,,,,,,,,,,,0,,,,,P,prés,,,337,-52.463105,4.928637
2019-1493514,2019-09-17,000001,Vente,50000,,,DUMAINE,B010,97356,97313,Montsinéry-Tonnegrande,973,,,97313000AY0597,,,,,,,,,,,,,0,,,,,P,prés,,,89,-52.463019,4.928482
2019-1493608,2019-10-04,000001,Vente,299000,33,9,LOT LES CHAMPS VIRGILE,A018,97356,97313,Montsinéry-Tonnegrande,973,,,97313000AY0593,,,,,,,,,,,,,0,1,Maison,127,4,S,sols,,,500,-52.461239,4.930477
2019-1493608,2019-10-04,000001,Vente,299000,33,9,LOT LES CHAMPS VIRGILE,A018,97356,97313,Montsinéry-Tonnegrande,973,,,97313000AY0593,,,,,,,,,,,,,0,1,Maison,127,4,L,landes,,,5244,-52.461239,4.930477
2019-1493612,2019-10-09,000001,Vente,5000,,,RISQUETOUT EST,B031,97356,97313,Montsinéry-Tonnegrande,973,,,97313000AZ0498,,,,,,,,,,,,,0,,,,,T,terres,,,10000,-52.514289,4.909977
2019-1493663,2019-10-14,000001,Vente,35000,,,PORT ININI NORD,B027,97356,97313,Montsinéry-Tonnegrande,973,,,97313000AS0147,,,,,,,,,,,,,0,,,,,L,landes,,,10000,-52.486485,4.828826
2019-1493663,2019-10-14,000001,Vente,35000,,,PORT ININI NORD,B027,97356,97313,Montsinéry-Tonnegrande,973,,,97313000AS0146,,,,,,,,,,,,,0,,,,,L,landes,,,10000,-52.487587,4.829187
2019-1493670,2019-10-11,000002,Vente,18000,,,RISQUETOUT OUEST,B032,97356,97313,Montsinéry-Tonnegrande,973,,,97313000BD0257,,,,,,,,,,,,,0,,,,,L,landes,,,4000,-52.528681,4.923694
2019-1493850,2019-11-07,000001,Vente,80000,,,DUMAINE,B010,97356,97313,Montsinéry-Tonnegrande,973,,,97313000AY0592,,,,,,,,,,,,,0,,,,,AB,terrains a bâtir,,,2128,-52.460872,4.930223
2019-1493868,2019-11-21,000001,Vente,7500,,,DUMAINE,B010,97356,97313,Montsinéry-Tonnegrande,973,,,97313000AY0208,,,,,,,,,,,,,0,,,,,L,landes,,,2500,-52.460711,4.92849
2019-1493914,2019-11-25,000001,Vente,20000,,,DUMAINE,B010,97356,97313,Montsinéry-Tonnegrande,973,,,97313000AY0574,,,,,,,,,,,,,0,,,,,AB,terrains a bâtir,,,2000,-52.450012,4.943397
2019-1493914,2019-11-25,000001,Vente,20000,,,DUMAINE,B010,97356,97313,Montsinéry-Tonnegrande,973,,,97313000AY0588,,,,,,,,,,,,,0,,,,,T,terres,,,4062,-52.449122,4.943445
2019-1494006,2019-12-06,000001,Vente,40000,,,BANANE,B001,97356,97313,Montsinéry-Tonnegrande,973,,,97313000AV0262,,,,,,,,,,,,,0,,,,,L,landes,,,5000,-52.520023,4.854874
2019-1494035,2019-11-13,000001,Vente,15000,,,GALLION EST,B012,97356,97313,Montsinéry-Tonnegrande,973,,,97313000AI0472,,,,,,,,,,,,,0,,,,,L,landes,,,10670,-52.401471,4.796872
2019-1494035,2019-11-13,000001,Vente,15000,,,GALLION EST,B012,97356,97313,Montsinéry-Tonnegrande,973,,,97313000AI0494,,,,,,,,,,,,,0,,,,,L,landes,,,2000,-52.39863,4.796486
2019-1494035,2019-11-13,000001,Vente,15000,,,GALLION EST,B012,97356,97313,Montsinéry-Tonnegrande,973,,,97313000AI0500,,,,,,,,,,,,,0,,,,,L,landes,,,13117,-52.40013,4.795901
2019-1494092,2019-12-19,000001,Vente,31500,,,GIGOGNE,B015,97356,97313,Montsinéry-Tonnegrande,973,,,97313000AR0216,,,,,,,,,,,,,0,,,,,L,landes,,,5000,-52.474338,4.796826
2019-1494153,2019-12-31,000001,Vente,120000,1000,,BANANE,B001,97356,97313,Montsinéry-Tonnegrande,973,,,97313000AV0247,,,,,,,,,,,,,0,3,Dépendance,,0,L,landes,,,28408,-52.525456,4.874354
2019-1494153,2019-12-31,000001,Vente,120000,1000,,BANANE,B001,97356,97313,Montsinéry-Tonnegrande,973,,,97313000AV0247,,,,,,,,,,,,,0,3,Dépendance,,0,VE,vergers,,,2010,-52.525456,4.874354
2019-1494162,2019-12-12,000001,Vente,8000,,,PORT ININI SUD,B028,97356,97313,Montsinéry-Tonnegrande,973,,,97313000AR0194,,,,,,,,,,,,,0,,,,,L,landes,,,10227,-52.480358,4.81238
2019-1494191,2019-12-31,000001,Vente,1,,,SAVANES DE MONTSINERY,B035,97356,97313,Montsinéry-Tonnegrande,973,,,97313000AX0306,,,,,,,,,,,,,0,,,,,L,landes,,,40,-52.49919,4.891018
