id_mutation,date_mutation,numero_disposition,nature_mutation,valeur_fonciere,adresse_numero,adresse_suffixe,adresse_nom_voie,adresse_code_voie,code_postal,code_commune,nom_commune,code_departement,ancien_code_commune,ancien_nom_commune,id_parcelle,ancien_id_parcelle,numero_volume,lot1_numero,lot1_surface_carrez,lot2_numero,lot2_surface_carrez,lot3_numero,lot3_surface_carrez,lot4_numero,lot4_surface_carrez,lot5_numero,lot5_surface_carrez,nombre_lots,code_type_local,type_local,surface_reelle_bati,nombre_pieces_principales,code_nature_culture,nature_culture,code_nature_culture_speciale,nature_culture_speciale,surface_terrain,longitude,latitude
2020-275722,2020-11-02,000001,Vente,15000,,,LA CAZE,B006,24400,24059,Bourgnac,24,,,240590000B1145,,,,,,,,,,,,,0,,,,,P,prés,,,537,0.403138,45.01517
2020-275722,2020-11-02,000001,Vente,15000,,,LA CAZE,B006,24400,24059,Bourgnac,24,,,240590000B1147,,,,,,,,,,,,,0,,,,,P,prés,,,1188,0.403356,45.015202
2020-275864,2020-11-24,000001,Vente,1000,,,LA LANDE,B029,24400,24059,Bourgnac,24,,,240590000C0325,,,,,,,,,,,,,0,,,,,P,prés,,,2560,0.409206,45.029785
2020-275864,2020-11-24,000001,Vente,1000,,,LA LANDE,B029,24400,24059,Bourgnac,24,,,240590000C0326,,,,,,,,,,,,,0,,,,,T,terres,,,550,0.409286,45.029544
2020-275864,2020-11-24,000001,Vente,1000,,,LA LANDE,B029,24400,24059,Bourgnac,24,,,240590000C0795,,,,,,,,,,,,,0,,,,,T,terres,,,1325,0.409487,45.029566
2020-280983,2020-03-10,000001,Vente,80000,,,LA LANDE,B029,24400,24059,Bourgnac,24,,,240590000C0312,,,,,,,,,,,,,0,,,,,T,terres,,,1040,0.412987,45.02977
2020-280983,2020-03-10,000001,Vente,80000,,,LA LANDE,B029,24400,24059,Bourgnac,24,,,240590000C0810,,,,,,,,,,,,,0,,,,,T,terres,,,470,0.413114,45.029623
2020-280983,2020-03-10,000001,Vente,80000,,,LA LANDE,B029,24400,24059,Bourgnac,24,,,240590000C0812,,,,,,,,,,,,,0,,,,,L,landes,,,1050,0.413377,45.029864
2020-280983,2020-03-10,000001,Vente,80000,,,LA LANDE,B029,24400,24059,Bourgnac,24,,,240590000C0814,,,,,,,,,,,,,0,,,,,BT,taillis simples,,,710,0.413732,45.029963
2020-280983,2020-03-10,000001,Vente,80000,1464,,RTE DE LA GOURLE,0360,24400,24059,Bourgnac,24,,,240590000C0887,,,,,,,,,,,,,0,1,Maison,63,3,S,sols,,,774,0.412655,45.029834
2020-280983,2020-03-10,000001,Vente,80000,,,LA LANDE,B029,24400,24059,Bourgnac,24,,,240590000C0895,,,,,,,,,,,,,0,,,,,BM,futaies mixtes,,,1892,0.413359,45.030085
2020-281141,2020-05-15,000001,Vente,74000,683,,RTE DU VAL DE CREMPSE,0830,24400,24059,Bourgnac,24,,,240590000C0017,,,,,,,,,,,,,0,1,Maison,57,3,P,prés,,,1310,0.407183,45.017901
2020-281141,2020-05-15,000001,Vente,74000,683,,RTE DU VAL DE CREMPSE,0830,24400,24059,Bourgnac,24,,,240590000C0017,,,,,,,,,,,,,0,1,Maison,57,3,S,sols,,,800,0.407183,45.017901
2020-281184,2020-05-28,000002,Vente,220,,,CHATONNIE,B007,24400,24059,Bourgnac,24,,,240590000A0940,,,,,,,,,,,,,0,,,,,BT,taillis simples,,,61,0.382402,45.019649
2020-281193,2020-05-29,000001,Vente,23500,,,LA MONNERIE,B038,24400,24059,Bourgnac,24,,,240590000D0390,,,,,,,,,,,,,0,,,,,S,sols,,,120,0.392952,45.020489
2020-281193,2020-05-29,000001,Vente,23500,1064,,LA MONNERIE,B038,24400,24059,Bourgnac,24,,,240590000D0391,,,,,,,,,,,,,0,3,Dépendance,,0,S,sols,,,365,0.393107,45.020484
2020-281193,2020-05-29,000001,Vente,23500,,,LA MONNERIE,B038,24400,24059,Bourgnac,24,,,240590000D0392,,,,,,,,,,,,,0,,,,,J,jardins,,,525,0.392965,45.020337
2020-281193,2020-05-29,000001,Vente,23500,,,LA MONNERIE,B038,24400,24059,Bourgnac,24,,,240590000D0393,,,,,,,,,,,,,0,,,,,P,prés,,,480,0.393034,45.020189
2020-281202,2020-05-29,000001,Vente,25000,,,LA LANDE,B029,24400,24059,Bourgnac,24,,,240590000C0960,,,,,,,,,,,,,0,,,,,T,terres,,,3,0.409764,45.030866
2020-281202,2020-05-29,000001,Vente,25000,,,LA LANDE,B029,24400,24059,Bourgnac,24,,,240590000C0961,,,,,,,,,,,,,0,,,,,T,terres,,,16,0.409917,45.030807
2020-281202,2020-05-29,000001,Vente,25000,,,LA LANDE,B029,24400,24059,Bourgnac,24,,,240590000C0964,,,,,,,,,,,,,0,,,,,T,terres,,,2296,0.409626,45.030495
2020-281278,2020-06-09,000001,Vente,600,,,FRONTIGNAC,B026,24400,24059,Bourgnac,24,,,240590000A0518,,,,,,,,,,,,,0,,,,,P,prés,,,2710,0.388166,45.018449
2020-281308,2020-05-28,000001,Vente,220,,,CHATONNIE,B007,24400,24059,Bourgnac,24,,,240590000A0098,,,,,,,,,,,,,0,,,,,L,landes,,,220,0.380717,45.020445
2020-281407,2020-06-30,000001,Vente,12000,,,GRAND BOST,B028,24400,24059,Bourgnac,24,,,240590000C0161,,,,,,,,,,,,,0,,,,,BM,futaies mixtes,,,2820,0.403733,45.027439
2020-281413,2020-06-26,000002,Vente,100,,,LE BOURG,B004,24400,24059,Bourgnac,24,,,240590000B1163,,,,,,,,,,,,,0,,,,,S,sols,,,59,0.402075,45.015765
2020-281608,2020-08-13,000001,Vente,127000,,,PEYRIFOL,B041,24400,24059,Bourgnac,24,,,240590000B0140,,,,,,,,,,,,,0,,,,,T,terres,,,470,0.411854,45.013246
2020-281608,2020-08-13,000001,Vente,127000,992,,RTE DE LA CASSONNADE,0080,24400,24059,Bourgnac,24,,,240590000B0141,,,,,,,,,,,,,0,1,Maison,80,2,S,sols,,,425,0.412023,45.013502
2020-281608,2020-08-13,000001,Vente,127000,,,PEYRIFOL,B041,24400,24059,Bourgnac,24,,,240590000B0143,,,,,,,,,,,,,0,,,,,S,sols,,,520,0.412337,45.013497
