id_mutation,date_mutation,numero_disposition,nature_mutation,valeur_fonciere,adresse_numero,adresse_suffixe,adresse_nom_voie,adresse_code_voie,code_postal,code_commune,nom_commune,code_departement,ancien_code_commune,ancien_nom_commune,id_parcelle,ancien_id_parcelle,numero_volume,lot1_numero,lot1_surface_carrez,lot2_numero,lot2_surface_carrez,lot3_numero,lot3_surface_carrez,lot4_numero,lot4_surface_carrez,lot5_numero,lot5_surface_carrez,nombre_lots,code_type_local,type_local,surface_reelle_bati,nombre_pieces_principales,code_nature_culture,nature_culture,code_nature_culture_speciale,nature_culture_speciale,surface_terrain,longitude,latitude
2020-275657,2020-11-19,000001,Vente,14000,,,LES PLAGNES,B295,24260,24172,Les Eyzies,24,,,241723890B0463,,,,,,,,,,,,,0,,,,,T,terres,,,1521,0.976542,44.929097
2020-275657,2020-11-19,000001,Vente,14000,,,LES PLAGNES,B295,24260,24172,Les Eyzies,24,,,241723890B0467,,,,,,,,,,,,,0,,,,,T,terres,,,735,0.976973,44.929412
2020-275672,2020-10-30,000001,Vente,146000,,,LA BALLOTERIE,B002,24620,24172,Les Eyzies,24,,,241725390A0312,,,,,,,,,,,,,0,,,,,S,sols,,,230,1.07357,44.960604
2020-275672,2020-10-30,000001,Vente,146000,,,LA BALLOTERIE,B002,24620,24172,Les Eyzies,24,,,241725390A0312,,,,,,,,,,,,,0,,,,,T,terres,,,2499,1.07357,44.960604
2020-275672,2020-10-30,000001,Vente,146000,11,C,LA BALLOTERIE,B002,24620,24172,Les Eyzies,24,,,241725390A0313,,,,,,,,,,,,,0,1,Maison,93,3,S,sols,,,847,1.07318,44.96069
2020-275672,2020-10-30,000001,Vente,146000,11,C,LA BALLOTERIE,B002,24620,24172,Les Eyzies,24,,,241725390A0313,,,,,,,,,,,,,0,1,Maison,93,3,T,terres,,,1280,1.07318,44.96069
2020-275672,2020-10-30,000001,Vente,146000,,,LA BALLOTERIE,B002,24620,24172,Les Eyzies,24,,,241725390A0599,,,,,,,,,,,,,0,,,,,BT,taillis simples,,,2022,1.074286,44.960532
2020-275899,2020-11-20,000001,Vente,1500,,,LE BANQUET,B003,24620,24172,Les Eyzies,24,,,24172000AE0050,,,,,,,,,,,,,0,,,,,P,prés,,,3403,1.031573,44.942676
2020-275951,2020-11-09,000001,Vente,123000,,,LE BOURG - MANAURIE,B189,24620,24172,Les Eyzies,24,,,24172249AM0007,,,,,,,,,,,,,0,,,,,T,terres,,,1908,0.989916,44.960114
2020-275951,2020-11-09,000001,Vente,123000,,,LE BOURG - MANAURIE,B189,24620,24172,Les Eyzies,24,,,24172249AM0100,,,,,,,,,,,,,0,,,,,L,landes,PATIS,Patis,306,0.98998,44.959888
2020-275951,2020-11-09,000001,Vente,123000,57,,LE BOURG - MANAURIE,B189,24620,24172,Les Eyzies,24,,,24172249AM0102,,,,,,,,,,,,,0,1,Maison,102,4,S,sols,,,419,0.9904,44.959768
2020-275971,2020-11-24,000001,Vente,81000,40,C,LE BOURG - SAINT-CIRQ,B283,24260,24172,Les Eyzies,24,,,241723890C0181,,,,,,,,,,,,,0,3,Dépendance,,0,S,sols,,,2775,0.977682,44.928337
2020-275971,2020-11-24,000001,Vente,81000,40,C,LE BOURG - SAINT-CIRQ,B283,24260,24172,Les Eyzies,24,,,241723890C0181,,,,,,,,,,,,,0,3,Dépendance,,0,S,sols,,,2775,0.977682,44.928337
2020-275971,2020-11-24,000001,Vente,81000,40,C,LE BOURG - SAINT-CIRQ,B283,24260,24172,Les Eyzies,24,,,241723890C0181,,,,,,,,,,,,,0,1,Maison,107,4,S,sols,,,2775,0.977682,44.928337
2020-275993,2020-11-20,000001,Vente,3000,,,COSTE DELADE,B208,24620,24172,Les Eyzies,24,,,24172249AH0005,,,,,,,,,,,,,0,,,,,BT,taillis simples,,,7392,0.989906,44.94902
2020-275993,2020-11-20,000001,Vente,3000,,,COSTE DELADE,B208,24620,24172,Les Eyzies,24,,,24172249AH0028,,,,,,,,,,,,,0,,,,,BT,taillis simples,,,5723,0.990849,44.949084
2020-275993,2020-11-20,000001,Vente,3000,,,GORGE D ENFER,B074,24620,24172,Les Eyzies,24,,,241720000E0250,,,,,,,,,,,,,0,,,,,BT,taillis simples,,,8440,0.989238,44.947502
2020-276074,2020-11-27,000001,Vente,640000,8,,TREMOULEDE,B150,24620,24172,Les Eyzies,24,,,241720000B1039,,,,,,,,,,,,,0,1,Maison,22,1,S,sols,,,568,1.048252,44.937088
2020-276074,2020-11-27,000001,Vente,640000,8,,TREMOULEDE,B150,24620,24172,Les Eyzies,24,,,241720000B1039,,,,,,,,,,,,,0,1,Maison,140,4,S,sols,,,568,1.048252,44.937088
2020-276074,2020-11-27,000001,Vente,640000,8,,TREMOULEDE,B150,24620,24172,Les Eyzies,24,,,241720000B1039,,,,,,,,,,,,,0,1,Maison,27,1,S,sols,,,568,1.048252,44.937088
2020-276074,2020-11-27,000001,Vente,640000,62,A,TREMOULEDE,B150,24620,24172,Les Eyzies,24,,,241720000B1044,,,,,,,,,,,,,0,3,Dépendance,,0,S,sols,,,160,1.048687,44.937157
2020-276074,2020-11-27,000001,Vente,640000,62,A,TREMOULEDE,B150,24620,24172,Les Eyzies,24,,,241720000B1044,,,,,,,,,,,,,0,3,Dépendance,,0,L,landes,BROUS,Broussailles ou buissons,5859,1.048687,44.937157
2020-276081,2020-11-27,000001,Vente,40000,,,LES MERLIAUDS,B102,24620,24172,Les Eyzies,24,,,241720000E0919,,,,,,,,,,,,,0,,,,,T,terres,,,42,0.982098,44.947918
2020-276081,2020-11-27,000001,Vente,40000,,,LES MERLIAUDS,B102,24620,24172,Les Eyzies,24,,,241720000E0920,,,,,,,,,,,,,0,,,,,T,terres,,,580,0.982236,44.947817
2020-276081,2020-11-27,000001,Vente,40000,,,LES MERLIAUDS,B102,24620,24172,Les Eyzies,24,,,241720000E0921,,,,,,,,,,,,,0,,,,,T,terres,,,24,0.982099,44.947769
2020-276081,2020-11-27,000001,Vente,40000,,,LES MERLIAUDS,B102,24620,24172,Les Eyzies,24,,,241720000E0925,,,,,,,,,,,,,0,,,,,S,sols,,,21,0.982098,44.947837
2020-276081,2020-11-27,000001,Vente,40000,,,LES MERLIAUDS,B102,24620,24172,Les Eyzies,24,,,241720000E0926,,,,,,,,,,,,,0,,,,,S,sols,,,77,0.982175,44.947837
2020-276081,2020-11-27,000001,Vente,40000,,,LES MERLIAUDS,B102,24620,24172,Les Eyzies,24,,,241720000E0928,,,,,,,,,,,,,0,,,,,T,terres,,,87,0.982532,44.947677
2020-276081,2020-11-27,000001,Vente,40000,,,LES MERLIAUDS,B102,24620,24172,Les Eyzies,24,,,241720000E1203,,,,,,,,,,,,,0,,,,,T,terres,,,2098,0.983246,44.947681
2020-276081,2020-11-27,000001,Vente,40000,,,LES MERLIAUDS,B102,24620,24172,Les Eyzies,24,,,241720000E1205,,,,,,,,,,,,,0,,,,,BT,taillis simples,,,34,0.982943,44.947708
2020-276081,2020-11-27,000001,Vente,40000,,,LES MERLIAUDS,B102,24620,24172,Les Eyzies,24,,,241720000E1206,,,,,,,,,,,,,0,,,,,BT,taillis simples,,,1325,0.982752,44.94773
2020-276298,2020-11-30,000001,Vente,80000,,,FONTVIALANE,B061,24620,24172,Les Eyzies,24,,,241720000B0327,,,,,,,,,,,,,0,,,,,L,landes,BROUS,Broussailles ou buissons,340,1.053422,44.93546
2020-276298,2020-11-30,000001,Vente,80000,62,,FONTVIALANE,B061,24620,24172,Les Eyzies,24,,,241720000B0328,,,,,,,,,,,,,0,1,Maison,72,3,S,sols,,,584,1.053688,44.935583
2020-276298,2020-11-30,000001,Vente,80000,62,,FONTVIALANE,B061,24620,24172,Les Eyzies,24,,,241720000B0328,,,,,,,,,,,,,0,1,Maison,16,1,S,sols,,,584,1.053688,44.935583
2020-276298,2020-11-30,000001,Vente,80000,62,,FONTVIALANE,B061,24620,24172,Les Eyzies,24,,,241720000B0328,,,,,,,,,,,,,0,1,Maison,15,1,S,sols,,,584,1.053688,44.935583
2020-276298,2020-11-30,000001,Vente,80000,,,FONTVIALANE,B061,24620,24172,Les Eyzies,24,,,241720000B0329,,,,,,,,,,,,,0,,,,,L,landes,,,2420,1.05402,44.935942
2020-276298,2020-11-30,000001,Vente,80000,,,FONTVIALANE,B061,24620,24172,Les Eyzies,24,,,241720000B0330,,,,,,,,,,,,,0,,,,,T,terres,,,4862,1.053885,44.936162
2020-276298,2020-11-30,000001,Vente,80000,,,FONTVIALANE,B061,24620,24172,Les Eyzies,24,,,241720000B0331,,,,,,,,,,,,,0,,,,,L,landes,BROUS,Broussailles ou buissons,2686,1.052993,44.935648
2020-276298,2020-11-30,000001,Vente,80000,,,FONTVIALANE,B061,24620,24172,Les Eyzies,24,,,241720000B0332,,,,,,,,,,,,,0,,,,,P,prés,,,1476,1.052217,44.935997
2020-276298,2020-11-30,000001,Vente,80000,,,FONTVIALANE,B061,24620,24172,Les Eyzies,24,,,241720000B0333,,,,,,,,,,,,,0,,,,,T,terres,,,4318,1.052704,44.936287
2020-276298,2020-11-30,000001,Vente,80000,,,FONTVIALANE,B061,24620,24172,Les Eyzies,24,,,241720000B0334,,,,,,,,,,,,,0,,,,,L,landes,,,2127,1.05332,44.936603
2020-276298,2020-11-30,000001,Vente,80000,,,FONTVIALANE,B061,24620,24172,Les Eyzies,24,,,241720000B0336,,,,,,,,,,,,,0,,,,,BT,taillis simples,,,4121,1.053273,44.937144
2020-276298,2020-11-30,000001,Vente,80000,,,FONTVIALANE,B061,24620,24172,Les Eyzies,24,,,241720000B0340,,,,,,,,,,,,,0,,,,,BT,taillis simples,,,3423,1.054068,44.937499
2020-276298,2020-11-30,000001,Vente,80000,,,FONTVIALANE,B061,24620,24172,Les Eyzies,24,,,241720000B0342,,,,,,,,,,,,,0,,,,,BT,taillis simples,,,4390,1.053451,44.937785
2020-276978,2020-12-11,000001,Vente,120000,52,,AV DE LA FORGE,0050,24620,24172,Les Eyzies,24,,,24172000AD0092,,,,,,,,,,,,,0,1,Maison,100,4,S,sols,,,190,1.025251,44.936712
2020-276978,2020-12-11,000001,Vente,120000,,,LA FORGE,B062,24620,24172,Les Eyzies,24,,,24172000AD0093,,,,,,,,,,,,,0,,,,,P,prés,,,645,1.025285,44.936555
2020-276978,2020-12-11,000001,Vente,120000,,,LA FORGE,B062,24620,24172,Les Eyzies,24,,,24172000AD0093,,,,,,,,,,,,,0,,,,,S,sols,,,156,1.025285,44.936555
2020-276978,2020-12-11,000001,Vente,120000,,,LA FORGE,B062,24620,24172,Les Eyzies,24,,,24172000AD0094,,,,,,,,,,,,,0,,,,,P,prés,,,762,1.025445,44.936114
2020-277108,2020-12-17,000001,Vente,350000,,,LE CAZAL,B197,24620,24172,Les Eyzies,24,,,24172249AL0037,,,,,,,,,,,,,0,,,,,BT,taillis simples,,,846,0.973505,44.967744
2020-277108,2020-12-17,000001,Vente,350000,,,LE CAZAL,B197,24620,24172,Les Eyzies,24,,,24172249AL0045,,,,,,,,,,,,,0,,,,,BT,taillis simples,,,421,0.973914,44.966773
2020-277108,2020-12-17,000001,Vente,350000,,,LE CAZAL,B197,24620,24172,Les Eyzies,24,,,24172249AL0047,,,,,,,,,,,,,0,,,,,BT,taillis simples,,,1080,0.973819,44.966191
2020-277108,2020-12-17,000001,Vente,350000,,,LE CAZAL,B197,24620,24172,Les Eyzies,24,,,24172249AL0049,,,,,,,,,,,,,0,,,,,BT,taillis simples,,,1064,0.973882,44.965672
2020-277108,2020-12-17,000001,Vente,350000,,,LE CAZAL,B197,24620,24172,Les Eyzies,24,,,24172249AL0052,,,,,,,,,,,,,0,,,,,BT,taillis simples,,,3238,0.975562,44.96617
2020-277108,2020-12-17,000001,Vente,350000,,,LE CAZAL,B197,24620,24172,Les Eyzies,24,,,24172249AL0054,,,,,,,,,,,,,0,,,,,BT,taillis simples,,,1040,0.976576,44.96605
2020-277108,2020-12-17,000001,Vente,350000,,,LE CAZAL,B197,24620,24172,Les Eyzies,24,,,24172249AL0055,,,,,,,,,,,,,0,,,,,BT,taillis simples,,,5002,0.976988,44.966416
2020-277108,2020-12-17,000001,Vente,350000,,,LE CAZAL,B197,24620,24172,Les Eyzies,24,,,24172249AL0056,,,,,,,,,,,,,0,,,,,BT,taillis simples,,,19,0.977572,44.966505
2020-277108,2020-12-17,000001,Vente,350000,,,LE CAZAL,B197,24620,24172,Les Eyzies,24,,,24172249AL0059,,,,,,,,,,,,,0,,,,,BS,taillis sous futaie,,,335,0.977368,44.966677
2020-277108,2020-12-17,000001,Vente,350000,49,,LE CAZAL,B197,24620,24172,Les Eyzies,24,,,24172249AL0062,,,,,,,,,,,,,0,1,Maison,180,6,S,sols,,,1645,0.976583,44.966749
2020-277108,2020-12-17,000001,Vente,350000,,,LE CAZAL,B197,24620,24172,Les Eyzies,24,,,24172249AL0063,,,,,,,,,,,,,0,,,,,P,prés,,,4212,0.97597,44.967211
2020-277108,2020-12-17,000001,Vente,350000,,,LE CAZAL,B197,24620,24172,Les Eyzies,24,,,24172249AL0064,,,,,,,,,,,,,0,,,,,BS,taillis sous futaie,,,3688,0.975969,44.96656
2020-277108,2020-12-17,000001,Vente,350000,,,LE CAZAL,B197,24620,24172,Les Eyzies,24,,,24172249AL0065,,,,,,,,,,,,,0,,,,,BT,taillis simples,,,4200,0.974936,44.966795
2020-277108,2020-12-17,000001,Vente,350000,,,LE CAZAL,B197,24620,24172,Les Eyzies,24,,,24172249AL0066,,,,,,,,,,,,,0,,,,,L,landes,PATIS,Patis,4000,0.974344,44.966987
2020-277108,2020-12-17,000001,Vente,350000,,,LE CAZAL,B197,24620,24172,Les Eyzies,24,,,24172249AL0067,,,,,,,,,,,,,0,,,,,P,prés,,,3628,0.974878,44.967303
2020-277108,2020-12-17,000001,Vente,350000,,,LE CAZAL,B197,24620,24172,Les Eyzies,24,,,24172249AL0068,,,,,,,,,,,,,0,,,,,L,landes,PATIS,Patis,3757,0.974449,44.967714
2020-277108,2020-12-17,000001,Vente,350000,,,LE CAZAL,B197,24620,24172,Les Eyzies,24,,,24172249AL0069,,,,,,,,,,,,,0,,,,,BT,taillis simples,,,3351,0.975334,44.967865
2020-277108,2020-12-17,000001,Vente,350000,,,LE CAZAL,B197,24620,24172,Les Eyzies,24,,,24172249AL0071,,,,,,,,,,,,,0,,,,,BS,taillis sous futaie,,,657,0.974936,44.967855
2020-277108,2020-12-17,000001,Vente,350000,,,LE CAZAL,B197,24620,24172,Les Eyzies,24,,,24172249AL0071,,,,,,,,,,,,,0,,,,,S,sols,,,399,0.974936,44.967855
2020-277108,2020-12-17,000001,Vente,350000,,,LE CAZAL,B197,24620,24172,Les Eyzies,24,,,24172249AL0073,,,,,,,,,,,,,0,,,,,BT,taillis simples,,,1513,0.974391,44.968362
2020-277138,2020-12-18,000001,Vente,120000,,,LE QUEYLOU,B130,24620,24172,Les Eyzies,24,,,241720000D0932,,,,,,,,,,,,,0,,,,,L,landes,,,936,1.003558,44.923934
2020-277138,2020-12-18,000001,Vente,120000,152,,LE QUEYLOU,B130,24620,24172,Les Eyzies,24,,,241720000D0983,,,,,,,,,,,,,0,1,Maison,116,4,S,sols,,,400,1.00337,44.923608
2020-277861,2020-12-28,000001,Vente,8985,,,PEYRELEVADE,B248,24620,24172,Les Eyzies,24,,,24172249AC0085,,,,,,,,,,,,,0,,,,,BT,taillis simples,,,15810,0.996429,44.975781
2020-277861,2020-12-28,000001,Vente,8985,,,PEYRELEVADE,B248,24620,24172,Les Eyzies,24,,,24172249AC0086,,,,,,,,,,,,,0,,,,,BT,taillis simples,,,890,0.996919,44.975213
2020-281996,2020-01-07,000001,Vente,103384,46,,AV DE LA PREHISTOIRE,0115,24620,24172,Les Eyzies,24,,,24172000AB0095,,,,,,,,,,,,,0,1,Maison,135,5,S,sols,,,715,1.010948,44.939176
2020-282040,2020-01-13,000001,Vente,360000,416,,LES PLAGNES,B295,24260,24172,Les Eyzies,24,,,241723890B0416,,,,,,,,,,,,,0,3,Dépendance,,0,T,terres,,,1525,0.973292,44.930158
2020-282040,2020-01-13,000001,Vente,360000,416,,LES PLAGNES,B295,24260,24172,Les Eyzies,24,,,241723890B0416,,,,,,,,,,,,,0,1,Maison,210,4,T,terres,,,1525,0.973292,44.930158
2020-282040,2020-01-13,000001,Vente,360000,,,LES PLAGNES,B295,24260,24172,Les Eyzies,24,,,241723890B0418,,,,,,,,,,,,,0,,,,,T,terres,,,234,0.97339,44.930176
2020-282040,2020-01-13,000001,Vente,360000,,,LES PLAGNES,B295,24260,24172,Les Eyzies,24,,,241723890B0452,,,,,,,,,,,,,0,,,,,T,terres,,,3215,0.973398,44.930413
2020-282071,2020-01-28,000001,Vente,34000,,,PAGENAL,B111,24620,24172,Les Eyzies,24,,,241720000D1241,,,,,,,,,,,,,0,,,,,S,sols,,,600,0.995247,44.921113
2020-282071,2020-01-28,000001,Vente,34000,,,PAGENAL,B111,24620,24172,Les Eyzies,24,,,241720000D1465,,,,,,,,,,,,,0,,,,,L,landes,,,578,0.995841,44.921227
2020-282071,2020-01-28,000001,Vente,34000,,,PAGENAL,B111,24620,24172,Les Eyzies,24,,,241720000D1468,,,,,,,,,,,,,0,,,,,BT,taillis simples,,,2703,0.995516,44.920889
2020-282071,2020-01-28,000001,Vente,34000,,,LE MOULINET,B107,24620,24172,Les Eyzies,24,,,241720000D1491,,,,,,,,,,,,,0,,,,,T,terres,,,1230,0.992608,44.92565
2020-282071,2020-01-28,000001,Vente,34000,,,PAGENAL,B111,24620,24172,Les Eyzies,24,,,241720000D1572,,,,,,,,,,,,,0,,,,,CA,carrières,,,3161,0.995343,44.921442
2020-282181,2020-01-30,000001,Vente,20000,,,LASSERRE PERDISSOU,B090,24620,24172,Les Eyzies,24,,,241725390C0499,,,,,,,,,,,,,0,,,,,T,terres,,,3545,1.092549,44.930158
2020-282181,2020-01-30,000001,Vente,20000,,,LASSERRE PERDISSOU,B090,24620,24172,Les Eyzies,24,,,241725390C0501,,,,,,,,,,,,,0,,,,,BT,taillis simples,,,1620,1.092144,44.930673
2020-282181,2020-01-30,000001,Vente,20000,,,LASSERRE PERDISSOU,B090,24620,24172,Les Eyzies,24,,,241725390C0502,,,,,,,,,,,,,0,,,,,BT,taillis simples,,,442,1.092214,44.930809
2020-282209,2020-02-25,000001,Vente,670,,,LE QUEYLOU,B130,24620,24172,Les Eyzies,24,,,241720000D0970,,,,,,,,,,,,,0,,,,,BT,taillis simples,,,670,1.001995,44.922685
2020-282213,2020-02-15,000001,Vente,35000,,,LE RAYSSE,B297,24260,24172,Les Eyzies,24,,,241723890B0311,,,,,,,,,,,,,0,,,,,T,terres,,,1480,0.98283,44.928077
2020-282213,2020-02-15,000001,Vente,35000,,,LES GARRIGUES,B068,24620,24172,Les Eyzies,24,,,241720000E0029,,,,,,,,,,,,,0,,,,,T,terres,,,8860,0.982901,44.928581
2020-282213,2020-02-15,000001,Vente,35000,,,LES GARRIGUES,B068,24620,24172,Les Eyzies,24,,,241720000E0033,,,,,,,,,,,,,0,,,,,P,prés,,,7060,0.982084,44.930094
2020-282254,2020-02-25,000001,Vente,778,,,LE QUEYLOU,B130,24620,24172,Les Eyzies,24,,,241720000D0969,,,,,,,,,,,,,0,,,,,BT,taillis simples,,,778,1.001816,44.922573
2020-282295,2020-02-28,000001,Vente,300,,,TAILLIS DE LA CIPIERE,B144,24620,24172,Les Eyzies,24,,,241725390A0344,,,,,,,,,,,,,0,,,,,BT,taillis simples,,,6725,1.079879,44.96364
2020-282348,2020-03-06,000001,Echange,1000,,,,,,24172,Les Eyzies,24,,,24172000AB0239,,1,,,,,,,,,,,0,,,,,,,,,,1.009983,44.940152
2020-282348,2020-03-06,000002,Echange,1000,2,,CHE DE CRO MAGNON,0040,24620,24172,Les Eyzies,24,,,24172000AB0220,,,,,,,,,,,,,0,,,,,S,sols,,,5,1.00984,44.940297
2020-282348,2020-03-06,000002,Echange,1000,54,,AV DE LA PREHISTOIRE,0115,24620,24172,Les Eyzies,24,,,24172000AB0242,,,,,,,,,,,,,0,,,,,S,sols,,,3,1.00986,44.94026
2020-282368,2020-03-16,000001,Vente,120000,9,B,LA BORIE DE SIREUIL,B018,24620,24172,Les Eyzies,24,,,241725390A0515,,,,,,,,,,,,,0,1,Maison,129,6,S,sols,,,1085,1.073744,44.950885
2020-282368,2020-03-16,000001,Vente,120000,9,B,LA BORIE DE SIREUIL,B018,24620,24172,Les Eyzies,24,,,241725390A0515,,,,,,,,,,,,,0,1,Maison,129,6,P,prés,,,1410,1.073744,44.950885
2020-282425,2020-03-12,000001,Vente,260000,7,A,LE VERDIER,B154,24620,24172,Les Eyzies,24,,,241725390A0569,,,,,,,,,,,,,0,1,Maison,168,4,L,landes,BROUS,Broussailles ou buissons,4059,1.058575,44.95077
2020-282425,2020-03-12,000001,Vente,260000,7,A,LE VERDIER,B154,24620,24172,Les Eyzies,24,,,241725390A0569,,,,,,,,,,,,,0,1,Maison,168,4,S,sols,,,500,1.058575,44.95077
2020-282431,2020-03-17,000001,Vente,56306,109,,LE BOUSQUET,B023,24620,24172,Les Eyzies,24,,,241720000C0109,,,,,,,,,,,,,0,1,Maison,54,2,S,sols,,,32,1.026119,44.935655
2020-282431,2020-03-17,000001,Vente,56306,,,LE BOUSQUET,B023,24620,24172,Les Eyzies,24,,,241720000C0736,,,,,,,,,,,,,0,,,,,L,landes,,,955,1.025915,44.935761
2020-282451,2020-03-09,000001,Vente,150,,,LE BOURG - SAINT-CIRQ,B283,24260,24172,Les Eyzies,24,,,241723890C0151,,,,,,,,,,,,,0,,,,,P,prés,,,1193,0.970053,44.927246
2020-282451,2020-03-09,000001,Vente,150,,,LE BOURG - SAINT-CIRQ,B283,24260,24172,Les Eyzies,24,,,241723890C0157,,,,,,,,,,,,,0,,,,,BT,taillis simples,CHENE,Chênes,1076,0.971114,44.927247
2020-282451,2020-03-09,000001,Vente,150,,,LE BOURG - SAINT-CIRQ,B283,24260,24172,Les Eyzies,24,,,241723890C0158,,,,,,,,,,,,,0,,,,,P,prés,,,2121,0.970644,44.92725
2020-282451,2020-03-09,000001,Vente,150,,,LE BOURG - SAINT-CIRQ,B283,24260,24172,Les Eyzies,24,,,241723890C0158,,,,,,,,,,,,,0,,,,,P,prés,,,2121,0.970644,44.92725
2020-282453,2020-03-06,000001,Vente,60000,54,,AV DE LA PREHISTOIRE,0115,24620,24172,Les Eyzies,24,,,24172000AB0225,,,,,,,,,,,,,0,1,Maison,114,3,S,sols,,,114,1.010254,44.940046
2020-282454,2020-03-06,000002,Vente,390000,,,,,,24172,Les Eyzies,24,,,24172000AB0239,,1,,,,,,,,,,,0,,,,,,,,,,1.009983,44.940152
2020-282454,2020-03-06,000002,Vente,390000,54,A,AV DE LA PREHISTOIRE,0115,24620,24172,Les Eyzies,24,,,24172000AB0241,,,,,,,,,,,,,0,4,Local industriel. commercial ou assimilé,32,0,S,sols,,,978,1.010141,44.940024
2020-282454,2020-03-06,000002,Vente,390000,54,A,AV DE LA PREHISTOIRE,0115,24620,24172,Les Eyzies,24,,,24172000AB0241,,,,,,,,,,,,,0,4,Local industriel. commercial ou assimilé,533,0,S,sols,,,978,1.010141,44.940024
2020-282454,2020-03-06,000002,Vente,390000,54,A,AV DE LA PREHISTOIRE,0115,24620,24172,Les Eyzies,24,,,24172000AB0241,,,,,,,,,,,,,0,4,Local industriel. commercial ou assimilé,215,0,S,sols,,,978,1.010141,44.940024
2020-282484,2020-04-02,000001,Vente,140000,,,LE PECH DE SIREUIL,B114,24620,24172,Les Eyzies,24,,,241725390C0837,,,,,,,,,,,,,0,,,,,J,jardins,POTAG,Jardin potager,1280,1.075579,44.938673
2020-282484,2020-04-02,000001,Vente,140000,,,LE PECH DE SIREUIL,B114,24620,24172,Les Eyzies,24,,,241725390C0838,,,,,,,,,,,,,0,,,,,S,sols,,,348,1.075412,44.938903
2020-282484,2020-04-02,000001,Vente,140000,12,,RUE DU CAMP DE CESAR,0023,24620,24172,Les Eyzies,24,,,241725390C0988,,,,,,,,,,,,,0,1,Maison,75,3,S,sols,,,267,1.075284,44.938972
2020-282560,2020-05-12,000001,Vente,72000,63,,LE BOURG - MANAURIE,B189,24620,24172,Les Eyzies,24,,,24172249AM0019,,,,,,,,,,,,,0,3,Dépendance,,0,J,jardins,POTAG,Jardin potager,231,0.99173,44.959772
2020-282560,2020-05-12,000001,Vente,72000,63,,LE BOURG - MANAURIE,B189,24620,24172,Les Eyzies,24,,,24172249AM0019,,,,,,,,,,,,,0,3,Dépendance,,0,S,sols,,,24,0.99173,44.959772
2020-282560,2020-05-12,000001,Vente,72000,63,,LE BOURG - MANAURIE,B189,24620,24172,Les Eyzies,24,,,24172249AM0020,,,,,,,,,,,,,0,1,Maison,65,4,S,sols,,,205,0.992005,44.95983
2020-282618,2020-05-27,000001,Vente,25000,5,,LES GIROUTEAUX,B072,24620,24172,Les Eyzies,24,,,241720000B0416,,,,,,,,,,,,,0,1,Maison,31,1,S,sols,,,235,1.029997,44.939666
2020-282618,2020-05-27,000001,Vente,25000,2,,LES GIROUTEAUX,B072,24620,24172,Les Eyzies,24,,,241720000B1029,,,,,,,,,,,,,0,1,Maison,21,1,S,sols,,,40,1.02978,44.93943
2020-282649,2020-05-27,000001,Vente,22000,,,LES PLAGNES,B295,24260,24172,Les Eyzies,24,,,241723890B0224,,,,,,,,,,,,,0,,,,,T,terres,,,3810,0.972656,44.931885
2020-282657,2020-06-03,000001,Vente,131100,,,LE PEUCH,B161,24620,24172,Les Eyzies,24,,,241720000E0001,,,,,,,,,,,,,0,,,,,P,prés,,,180,0.9838,44.926861
2020-282657,2020-06-03,000001,Vente,131100,,,LE PEUCH,B161,24620,24172,Les Eyzies,24,,,241720000E0002,,,,,,,,,,,,,0,,,,,P,prés,,,28120,,
2020-282657,2020-06-03,000001,Vente,131100,,,LE PEUCH,B161,24620,24172,Les Eyzies,24,,,241720000E0003,,,,,,,,,,,,,0,,,,,T,terres,,,34640,0.989163,44.927265
2020-282657,2020-06-03,000001,Vente,131100,,,LE PEUCH,B161,24620,24172,Les Eyzies,24,,,241720000E0004,,,,,,,,,,,,,0,,,,,P,prés,,,34460,,
2020-282657,2020-06-03,000001,Vente,131100,,,LE PEUCH,B161,24620,24172,Les Eyzies,24,,,241720000E0005,,,,,,,,,,,,,0,,,,,VI,vignes,,,7957,,
2020-282657,2020-06-03,000001,Vente,131100,,,LE PEUCH,B161,24620,24172,Les Eyzies,24,,,241720000E0006,,,,,,,,,,,,,0,,,,,L,landes,,,945,0.994322,44.927404
2020-282657,2020-06-03,000001,Vente,131100,,,LE PEUCH,B161,24620,24172,Les Eyzies,24,,,241720000E0007,,,,,,,,,,,,,0,,,,,T,terres,,,7433,,
2020-282657,2020-06-03,000001,Vente,131100,,,LE PEUCH,B161,24620,24172,Les Eyzies,24,,,241720000E0008,,,,,,,,,,,,,0,,,,,T,terres,,,22700,0.992514,44.928246
2020-282657,2020-06-03,000001,Vente,131100,,,LE PEUCH,B161,24620,24172,Les Eyzies,24,,,241720000E0009,,,,,,,,,,,,,0,,,,,T,terres,,,2970,0.988919,44.927899
2020-282657,2020-06-03,000001,Vente,131100,,,LE PEUCH,B161,24620,24172,Les Eyzies,24,,,241720000E0010,,,,,,,,,,,,,0,,,,,T,terres,,,13740,0.986002,44.927687
2020-282657,2020-06-03,000001,Vente,131100,,,LA BORIE,B017,24620,24172,Les Eyzies,24,,,241720000E0358,,,,,,,,,,,,,0,,,,,T,terres,,,12672,,
2020-282657,2020-06-03,000001,Vente,131100,,,LA BORIE,B017,24620,24172,Les Eyzies,24,,,241720000E0359,,,,,,,,,,,,,0,,,,,P,prés,,,1650,,
2020-282657,2020-06-03,000001,Vente,131100,,,LA BORIE,B017,24620,24172,Les Eyzies,24,,,241720000E0360,,,,,,,,,,,,,0,,,,,P,prés,,,1330,0.99635,44.927766
2020-282657,2020-06-03,000001,Vente,131100,,,LA BORIE,B017,24620,24172,Les Eyzies,24,,,241720000E0361,,,,,,,,,,,,,0,,,,,VI,vignes,,,1813,,
2020-282657,2020-06-03,000001,Vente,131100,,,LA BORIE,B017,24620,24172,Les Eyzies,24,,,241720000E0362,,,,,,,,,,,,,0,,,,,T,terres,,,2812,0.996205,44.92867
2020-282657,2020-06-03,000001,Vente,131100,,,LA BORIE,B017,24620,24172,Les Eyzies,24,,,241720000E0364,,,,,,,,,,,,,0,,,,,T,terres,,,2800,0.997582,44.928542
2020-282657,2020-06-03,000001,Vente,131100,,,LA BORIE,B017,24620,24172,Les Eyzies,24,,,241720000E0365,,,,,,,,,,,,,0,,,,,P,prés,,,1200,,
2020-282657,2020-06-03,000001,Vente,131100,,,LA BORIE,B017,24620,24172,Les Eyzies,24,,,241720000E0366,,,,,,,,,,,,,0,,,,,P,prés,,,464,0.997866,44.928046
2020-282657,2020-06-03,000001,Vente,131100,,,LA BORIE,B017,24620,24172,Les Eyzies,24,,,241720000E0367,,,,,,,,,,,,,0,,,,,T,terres,,,855,,
2020-282657,2020-06-03,000001,Vente,131100,,,LA BORIE,B017,24620,24172,Les Eyzies,24,,,241720000E0368,,,,,,,,,,,,,0,,,,,T,terres,,,3100,0.998474,44.928596
2020-282744,2020-06-16,000002,Vente,72000,,,SERRES,B142,24620,24172,Les Eyzies,24,,,241720000E0490,,,,,,,,,,,,,0,,,,,L,landes,,,1824,1.002699,44.933744
2020-282744,2020-06-16,000002,Vente,72000,,,SERRES,B142,24620,24172,Les Eyzies,24,,,241720000E0491,,,,,,,,,,,,,0,,,,,VI,vignes,,,3497,1.002784,44.933978
2020-282744,2020-06-16,000002,Vente,72000,,,SERRES,B142,24620,24172,Les Eyzies,24,,,241720000E0494,,,,,,,,,,,,,0,,,,,S,sols,,,11,1.003325,44.934139
2020-282744,2020-06-16,000002,Vente,72000,,,SERRES,B142,24620,24172,Les Eyzies,24,,,241720000E0496,,,,,,,,,,,,,0,,,,,BT,taillis simples,,,4080,1.003549,44.934917
2020-282744,2020-06-16,000002,Vente,72000,,,SERRES,B142,24620,24172,Les Eyzies,24,,,241720000E1224,,,,,,,,,,,,,0,,,,,L,landes,,,140,1.003133,44.934329