id_mutation,date_mutation,numero_disposition,nature_mutation,valeur_fonciere,adresse_numero,adresse_suffixe,adresse_nom_voie,adresse_code_voie,code_postal,code_commune,nom_commune,code_departement,ancien_code_commune,ancien_nom_commune,id_parcelle,ancien_id_parcelle,numero_volume,lot1_numero,lot1_surface_carrez,lot2_numero,lot2_surface_carrez,lot3_numero,lot3_surface_carrez,lot4_numero,lot4_surface_carrez,lot5_numero,lot5_surface_carrez,nombre_lots,code_type_local,type_local,surface_reelle_bati,nombre_pieces_principales,code_nature_culture,nature_culture,code_nature_culture_speciale,nature_culture_speciale,surface_terrain,longitude,latitude
2020-279106,2020-05-06,000001,Vente,3000,,,LES CABANNES,B005,24540,24244,Lolme,24,,,242440000A0658,,,,,,,,,,,,,0,,,,,BT,taillis simples,,,13580,0.861306,44.70397
2020-279110,2020-05-06,000001,Vente,6000,,,LE SELLIER,B023,24540,24244,Lolme,24,,,242440000A0624,,,,,,,,,,,,,0,,,,,BT,taillis simples,,,2235,0.859134,44.711631
2020-279110,2020-05-06,000001,Vente,6000,,,LES CABANNES,B005,24540,24244,Lolme,24,,,242440000A0628,,,,,,,,,,,,,0,,,,,BT,taillis simples,,,5980,0.861086,44.709825
2020-279110,2020-05-06,000001,Vente,6000,,,LES CABANNES,B005,24540,24244,Lolme,24,,,242440000A0677,,,,,,,,,,,,,0,,,,,BT,taillis simples,,,4220,0.860622,44.709582
2020-279110,2020-05-06,000001,Vente,6000,,,AU ROUCOU,B021,24540,24244,Lolme,24,,,242440000B0160,,,,,,,,,,,,,0,,,,,BT,taillis simples,,,6840,0.858568,44.711272
2020-279121,2020-05-06,000002,Echange,6000,,,LE SELLIER,B023,24540,24244,Lolme,24,,,242440000A0624,,,,,,,,,,,,,0,,,,,BT,taillis simples,,,2235,0.859134,44.711631
2020-279121,2020-05-06,000002,Echange,6000,,,LES CABANNES,B005,24540,24244,Lolme,24,,,242440000A0628,,,,,,,,,,,,,0,,,,,BT,taillis simples,,,5980,0.861086,44.709825
2020-279121,2020-05-06,000002,Echange,6000,,,LES CABANNES,B005,24540,24244,Lolme,24,,,242440000A0677,,,,,,,,,,,,,0,,,,,BT,taillis simples,,,4220,0.860622,44.709582
2020-279121,2020-05-06,000002,Echange,6000,,,AU ROUCOU,B021,24540,24244,Lolme,24,,,242440000B0160,,,,,,,,,,,,,0,,,,,BT,taillis simples,,,6840,0.858568,44.711272
2020-279121,2020-05-06,000003,Echange,6000,,,LES CABANNES,B005,24540,24244,Lolme,24,,,242440000A0655,,,,,,,,,,,,,0,,,,,BT,taillis simples,,,4655,0.861528,44.705443
2020-279121,2020-05-06,000003,Echange,6000,,,LES CABANNES,B005,24540,24244,Lolme,24,,,242440000A0656,,,,,,,,,,,,,0,,,,,BT,taillis simples,,,4005,0.860733,44.705512
2020-279154,2020-05-15,000001,Vente,4000,,,AU COMMUNAL,B008,24540,24244,Lolme,24,,,242440000B0205,,,,,,,,,,,,,0,,,,,T,terres,,,3540,0.85828,44.706202
2020-279154,2020-05-15,000001,Vente,4000,,,AU COMMUNAL,B008,24540,24244,Lolme,24,,,242440000B0206,,,,,,,,,,,,,0,,,,,BT,taillis simples,,,2520,0.858856,44.706095
2020-279237,2020-05-29,000001,Vente,163550,7,B,A LEY BOLLE,B016,24540,24244,Lolme,24,,,242440000A0494,,,,,,,,,,,,,0,1,Maison,192,6,S,sols,,,570,0.848181,44.719541
2020-279237,2020-05-29,000001,Vente,163550,7,B,A LEY BOLLE,B016,24540,24244,Lolme,24,,,242440000A0494,,,,,,,,,,,,,0,3,Dépendance,,0,S,sols,,,570,0.848181,44.719541
2020-279237,2020-05-29,000001,Vente,163550,,,A LEY BOLLE,B016,24540,24244,Lolme,24,,,242440000A0495,,,,,,,,,,,,,0,,,,,T,terres,,,3830,0.847836,44.719693
2020-279237,2020-05-29,000001,Vente,163550,,,A LEY BOLLE,B016,24540,24244,Lolme,24,,,242440000A0495,,,,,,,,,,,,,0,,,,,S,sols,,,500,0.847836,44.719693
2020-279677,2020-07-22,000001,Vente,11000,,,LES CABANNES,B005,24540,24244,Lolme,24,,,242440000A0657,,,,,,,,,,,,,0,,,,,BT,taillis simples,,,13080,0.861391,44.704748
2020-279677,2020-07-22,000001,Vente,11000,,,AU COMMUNAL,B008,24540,24244,Lolme,24,,,242440000B0211,,,,,,,,,,,,,0,,,,,L,landes,,,2630,0.85826,44.704133
2020-279677,2020-07-22,000001,Vente,11000,,,AU COMMUNAL,B008,24540,24244,Lolme,24,,,242440000B0212,,,,,,,,,,,,,0,,,,,L,landes,,,13260,0.857009,44.704025
2020-280302,2020-10-01,000001,Vente,35000,5,A,LE CHAMP,B006,24540,24244,Lolme,24,,,242440000A0723,,,,,,,,,,,,,0,1,Maison,37,2,S,sols,,,492,0.843074,44.714713
2020-280302,2020-10-01,000001,Vente,35000,5,A,LE CHAMP,B006,24540,24244,Lolme,24,,,242440000A0723,,,,,,,,,,,,,0,1,Maison,37,2,T,terres,,,500,0.843074,44.714713
2020-280302,2020-10-01,000001,Vente,35000,,,LE CHAMP,B006,24540,24244,Lolme,24,,,242440000A0829,,,,,,,,,,,,,0,,,,,T,terres,,,79,0.843303,44.71477
2020-280302,2020-10-01,000001,Vente,35000,,,LE CHAMP,B006,24540,24244,Lolme,24,,,242440000A0829,,,,,,,,,,,,,0,,,,,S,sols,,,100,0.843303,44.71477
2020-280302,2020-10-01,000001,Vente,35000,,,LE CHAMP,B006,24540,24244,Lolme,24,,,242440000A0830,,,,,,,,,,,,,0,,,,,T,terres,,,36,0.843072,44.714616
