id_mutation,date_mutation,numero_disposition,nature_mutation,valeur_fonciere,adresse_numero,adresse_suffixe,adresse_nom_voie,adresse_code_voie,code_postal,code_commune,nom_commune,code_departement,ancien_code_commune,ancien_nom_commune,id_parcelle,ancien_id_parcelle,numero_volume,lot1_numero,lot1_surface_carrez,lot2_numero,lot2_surface_carrez,lot3_numero,lot3_surface_carrez,lot4_numero,lot4_surface_carrez,lot5_numero,lot5_surface_carrez,nombre_lots,code_type_local,type_local,surface_reelle_bati,nombre_pieces_principales,code_nature_culture,nature_culture,code_nature_culture_speciale,nature_culture_speciale,surface_terrain,longitude,latitude
2020-276214,2020-11-17,000001,Vente,17000,,,SAINT-GEORGES OUEST,B049,24140,24414,Saint-Georges-de-Montclard,24,,,244140000A0772,,,,,,,,,,,,,0,,,,,P,prés,,,27,0.609339,44.944997
2020-276214,2020-11-17,000001,Vente,17000,,,SAINT-GEORGES OUEST,B049,24140,24414,Saint-Georges-de-Montclard,24,,,244140000A0773,,,,,,,,,,,,,0,,,,,P,prés,,,384,0.609965,44.944793
2020-276214,2020-11-17,000001,Vente,17000,,,SAINT-GEORGES OUEST,B049,24140,24414,Saint-Georges-de-Montclard,24,,,244140000A0775,,,,,,,,,,,,,0,,,,,P,prés,,,905,0.610351,44.944739
2020-276214,2020-11-17,000001,Vente,17000,,,SAINT-GEORGES OUEST,B049,24140,24414,Saint-Georges-de-Montclard,24,,,244140000A0777,,,,,,,,,,,,,0,,,,,E,eaux,,,3220,0.61127,44.944655
2020-276214,2020-11-17,000001,Vente,17000,,,SAINT-GEORGES OUEST,B049,24140,24414,Saint-Georges-de-Montclard,24,,,244140000A0778,,,,,,,,,,,,,0,,,,,S,sols,,,72,0.612389,44.94435
2020-276990,2020-11-30,000001,Vente,367000,850,,IMP DE LA RUCHELLE,0600,24140,24414,Saint-Georges-de-Montclard,24,,,244140000C0907,,,,,,,,,,,,,0,1,Maison,102,4,S,sols,,,1000,0.636351,44.927121
2020-276990,2020-11-30,000001,Vente,367000,850,,IMP DE LA RUCHELLE,0600,24140,24414,Saint-Georges-de-Montclard,24,,,244140000C0907,,,,,,,,,,,,,0,3,Dépendance,,0,S,sols,,,1000,0.636351,44.927121
2020-276990,2020-11-30,000001,Vente,367000,850,,IMP DE LA RUCHELLE,0600,24140,24414,Saint-Georges-de-Montclard,24,,,244140000C0907,,,,,,,,,,,,,0,1,Maison,109,2,S,sols,,,1000,0.636351,44.927121
2020-276990,2020-11-30,000001,Vente,367000,850,,IMP DE LA RUCHELLE,0600,24140,24414,Saint-Georges-de-Montclard,24,,,244140000C0907,,,,,,,,,,,,,0,3,Dépendance,,0,P,prés,,,2093,0.636351,44.927121
2020-276990,2020-11-30,000001,Vente,367000,850,,IMP DE LA RUCHELLE,0600,24140,24414,Saint-Georges-de-Montclard,24,,,244140000C0907,,,,,,,,,,,,,0,1,Maison,109,2,P,prés,,,2093,0.636351,44.927121
2020-276990,2020-11-30,000001,Vente,367000,850,,IMP DE LA RUCHELLE,0600,24140,24414,Saint-Georges-de-Montclard,24,,,244140000C0907,,,,,,,,,,,,,0,1,Maison,102,4,P,prés,,,2093,0.636351,44.927121
2020-277066,2020-12-09,000001,Vente,179000,,,LAUQUERIE BASSE,B031,24140,24414,Saint-Georges-de-Montclard,24,,,244140000A0233,,,,,,,,,,,,,0,,,,,L,landes,,,9530,0.612232,44.947676
2020-277066,2020-12-09,000001,Vente,179000,1295,,IMP DES ARCHERS,0040,24140,24414,Saint-Georges-de-Montclard,24,,,244140000A0793,,,,,,,,,,,,,0,1,Maison,110,2,S,sols,,,800,0.611907,44.948477
2020-277066,2020-12-09,000001,Vente,179000,1295,,IMP DES ARCHERS,0040,24140,24414,Saint-Georges-de-Montclard,24,,,244140000A0793,,,,,,,,,,,,,0,1,Maison,110,2,BT,taillis simples,,,11689,0.611907,44.948477
2020-277066,2020-12-09,000001,Vente,179000,,,LAUQUERIE BASSE,B031,24140,24414,Saint-Georges-de-Montclard,24,,,244140000A0795,,,,,,,,,,,,,0,,,,,L,landes,,,28502,0.611541,44.947301
2020-277066,2020-12-09,000001,Vente,179000,,,LAUQUERIE HAUTE,B032,24140,24414,Saint-Georges-de-Montclard,24,,,244140000A0869,,,,,,,,,,,,,0,,,,,BT,taillis simples,,,1343,0.612065,44.948627
2020-277066,2020-12-09,000001,Vente,179000,,,LAUQUERIE HAUTE,B032,24140,24414,Saint-Georges-de-Montclard,24,,,244140000A0873,,,,,,,,,,,,,0,,,,,BT,taillis simples,,,875,0.61204,44.948651
2020-277066,2020-12-09,000001,Vente,179000,,,LAUQUERIE BASSE,B031,24140,24414,Saint-Georges-de-Montclard,24,,,244140000A0874,,,,,,,,,,,,,0,,,,,BT,taillis simples,,,1004,0.610674,44.94828
2020-278310,2020-01-03,000001,Vente,32000,,,LE BOSQUET,B006,24140,24414,Saint-Georges-de-Montclard,24,,,244140000B0682,,,,,,,,,,,,,0,,,,,P,prés,,,2500,0.617543,44.927778
2020-278782,2020-02-24,000001,Vente,192500,,,LA FONT DE SOULE,B021,24140,24414,Saint-Georges-de-Montclard,24,,,244140000C0187,,,,,,,,,,,,,0,,,,,S,sols,,,526,0.620324,44.917042
2020-278782,2020-02-24,000001,Vente,192500,3533,,IMP TACOT,0650,24140,24414,Saint-Georges-de-Montclard,24,,,244140000C0188,,,,,,,,,,,,,0,4,Local industriel. commercial ou assimilé,131,0,S,sols,,,1326,0.620168,44.916582
2020-278782,2020-02-24,000001,Vente,192500,3533,,IMP TACOT,0650,24140,24414,Saint-Georges-de-Montclard,24,,,244140000C0188,,,,,,,,,,,,,0,1,Maison,120,4,S,sols,,,1326,0.620168,44.916582
2020-278782,2020-02-24,000001,Vente,192500,,,LA FONT DE SOULE,B021,24140,24414,Saint-Georges-de-Montclard,24,,,244140000C0748,,,,,,,,,,,,,0,,,,,P,prés,,,4613,0.620436,44.917078
2020-278782,2020-02-24,000001,Vente,192500,,,LA FONT DE SOULE,B021,24140,24414,Saint-Georges-de-Montclard,24,,,244140000C0951,,,,,,,,,,,,,0,,,,,T,terres,,,1682,0.620144,44.916342
2020-278808,2020-02-21,000001,Vente,370000,,,BESSARONNIE,B003,24140,24414,Saint-Georges-de-Montclard,24,,,244140000A0475,,,,,,,,,,,,,0,,,,,T,terres,,,403,0.615716,44.941896
2020-278808,2020-02-21,000001,Vente,370000,415,,RTE DU PUITS ANCIEN,0550,24140,24414,Saint-Georges-de-Montclard,24,,,244140000A0476,,,,,,,,,,,,,0,1,Maison,135,4,S,sols,,,719,0.615563,44.941847
2020-278808,2020-02-21,000001,Vente,370000,,,BESSARONNIE,B003,24140,24414,Saint-Georges-de-Montclard,24,,,244140000A0968,,,,,,,,,,,,,0,,,,,S,sols,,,274,0.615462,44.941664
2020-278808,2020-02-21,000001,Vente,370000,,,BESSARONNIE,B003,24140,24414,Saint-Georges-de-Montclard,24,,,244140000A0970,,,,,,,,,,,,,0,,,,,T,terres,,,3548,0.616137,44.94141
2020-278829,2020-02-26,000001,Vente,7000,,,FONT PEYROLE,B022,24140,24414,Saint-Georges-de-Montclard,24,,,244140000B0199,,,,,,,,,,,,,0,,,,,BT,taillis simples,,,7995,0.602534,44.925686
2020-278829,2020-02-26,000001,Vente,7000,,,FONT PEYROLE,B022,24140,24414,Saint-Georges-de-Montclard,24,,,244140000B0199,,,,,,,,,,,,,0,,,,,P,prés,,,1194,0.602534,44.925686
2020-278829,2020-02-26,000001,Vente,7000,,,FONT PEYROLE,B022,24140,24414,Saint-Georges-de-Montclard,24,,,244140000B0199,,,,,,,,,,,,,0,,,,,L,landes,,,488,0.602534,44.925686
2020-278829,2020-02-26,000001,Vente,7000,,,FONT PEYROLE,B022,24140,24414,Saint-Georges-de-Montclard,24,,,244140000B0199,,,,,,,,,,,,,0,,,,,BT,taillis simples,,,2151,0.602534,44.925686
2020-278829,2020-02-26,000001,Vente,7000,,,FONT PEYROLE,B022,24140,24414,Saint-Georges-de-Montclard,24,,,244140000B0200,,,,,,,,,,,,,0,,,,,VE,vergers,,,1795,0.602814,44.924763
2020-278829,2020-02-26,000001,Vente,7000,,,FONT PEYROLE,B022,24140,24414,Saint-Georges-de-Montclard,24,,,244140000B0201,,,,,,,,,,,,,0,,,,,S,sols,,,30,0.602898,44.924564
2020-278829,2020-02-26,000001,Vente,7000,,,FONT PEYROLE,B022,24140,24414,Saint-Georges-de-Montclard,24,,,244140000B0464,,,,,,,,,,,,,0,,,,,T,terres,,,7541,0.603326,44.9247
2020-278829,2020-02-26,000001,Vente,7000,,,FONT PEYROLE,B022,24140,24414,Saint-Georges-de-Montclard,24,,,244140000B0466,,,,,,,,,,,,,0,,,,,T,terres,,,49,0.604055,44.92478
2020-278882,2020-03-10,000001,Vente,309360,,,MONCLARD,B037,24140,24414,Saint-Georges-de-Montclard,24,,,244140000B0301,,,,,,,,,,,,,0,,,,,S,sols,,,60,0.61971,44.931858
2020-278882,2020-03-10,000001,Vente,309360,,,MONCLARD,B037,24140,24414,Saint-Georges-de-Montclard,24,,,244140000B0370,,,,,,,,,,,,,0,,,,,S,sols,,,151,0.619474,44.931767
2020-278882,2020-03-10,000001,Vente,309360,24,,RTE DE FONT PEYROL,0250,24140,24414,Saint-Georges-de-Montclard,24,,,244140000B0373,,,,,,,,,,,,,0,1,Maison,187,4,S,sols,,,99,0.619634,44.93179
2020-278882,2020-03-10,000001,Vente,309360,,,MONCLARD,B037,24140,24414,Saint-Georges-de-Montclard,24,,,244140000B0374,,,,,,,,,,,,,0,,,,,S,sols,,,149,0.619558,44.931724
2020-278882,2020-03-10,000001,Vente,309360,,,MONCLARD,B037,24140,24414,Saint-Georges-de-Montclard,24,,,244140000B0501,,,,,,,,,,,,,0,,,,,S,sols,,,30,0.619653,44.931842
2020-279036,2020-04-03,000001,Vente,146100,371,,RTE DU PRE PARAU,0540,24140,24414,Saint-Georges-de-Montclard,24,,,244140000B0499,,,,,,,,,,,,,0,1,Maison,60,2,S,sols,,,792,0.62439,44.931873
2020-279036,2020-04-03,000001,Vente,146100,371,,RTE DU PRE PARAU,0540,24140,24414,Saint-Georges-de-Montclard,24,,,244140000B0499,,,,,,,,,,,,,0,1,Maison,50,3,S,sols,,,792,0.62439,44.931873
2020-279036,2020-04-03,000001,Vente,146100,371,,RTE DU PRE PARAU,0540,24140,24414,Saint-Georges-de-Montclard,24,,,244140000B0499,,,,,,,,,,,,,0,1,Maison,80,5,S,sols,,,792,0.62439,44.931873
2020-279036,2020-04-03,000001,Vente,146100,371,,RTE DU PRE PARAU,0540,24140,24414,Saint-Georges-de-Montclard,24,,,244140000B0499,,,,,,,,,,,,,0,1,Maison,178,6,S,sols,,,792,0.62439,44.931873
2020-279036,2020-04-03,000001,Vente,146100,,,LE CAUDEAU,B015,24140,24414,Saint-Georges-de-Montclard,24,,,244140000B0504,,,,,,,,,,,,,0,,,,,T,terres,,,1603,0.624789,44.933226
2020-279036,2020-04-03,000001,Vente,146100,,,LE CAUDEAU,B015,24140,24414,Saint-Georges-de-Montclard,24,,,244140000B0506,,,,,,,,,,,,,0,,,,,T,terres,,,848,0.624816,44.932598
2020-279036,2020-04-03,000001,Vente,146100,,,PECHALIER,B043,24140,24414,Saint-Georges-de-Montclard,24,,,244140000B0696,,,,,,,,,,,,,0,,,,,L,landes,,,295,0.624394,44.932145
2020-279439,2020-06-03,000001,Vente,1,,,LES MONDOUX,B038,24140,24414,Saint-Georges-de-Montclard,24,,,244140000C1072,,,,,,,,,,,,,0,,,,,T,terres,,,489,0.625195,44.92117
2020-279889,2020-07-30,000001,Vente,5500,,,LA RUCHELLE,B046,24140,24414,Saint-Georges-de-Montclard,24,,,244140000C0609,,,,,,,,,,,,,0,,,,,P,prés,,,9000,0.626514,44.928393
2020-279889,2020-07-30,000001,Vente,5500,,,LES MONDOUX,B038,24140,24414,Saint-Georges-de-Montclard,24,,,244140000C0713,,,,,,,,,,,,,0,,,,,BT,taillis simples,,,11231,0.624878,44.926386
2020-280150,2020-08-27,000001,Vente,175000,661,,IMP DES ACACIAS,0020,24140,24414,Saint-Georges-de-Montclard,24,,,244140000C1060,,,,,,,,,,,,,0,1,Maison,109,4,S,sols,,,800,0.62134,44.926131
2020-280150,2020-08-27,000001,Vente,175000,661,,IMP DES ACACIAS,0020,24140,24414,Saint-Georges-de-Montclard,24,,,244140000C1060,,,,,,,,,,,,,0,1,Maison,109,4,AG,terrains d'agrément,,,1717,0.62134,44.926131
2020-280261,2020-09-29,000001,Vente,111000,50,,MONCLARD,B037,24140,24414,Saint-Georges-de-Montclard,24,,,244140000B0677,,,,,,,,,,,,,0,1,Maison,70,3,S,sols,,,258,0.619349,44.932066
2020-280261,2020-09-29,000001,Vente,111000,,,MONCLARD,B037,24140,24414,Saint-Georges-de-Montclard,24,,,244140000B0679,,,,,,,,,,,,,0,,,,,J,jardins,,,19,0.619237,44.931991
2020-280433,2020-09-25,000001,Vente,195000,,,COURS,B018,24140,24414,Saint-Georges-de-Montclard,24,,,244140000C0890,,,,,,,,,,,,,0,,,,,T,terres,,,60,0.634332,44.930082
2020-280433,2020-09-25,000001,Vente,195000,,,COURS,B018,24140,24414,Saint-Georges-de-Montclard,24,,,244140000C1074,,,,,,,,,,,,,0,,,,,P,prés,,,14,0.634053,44.929939
2020-280433,2020-09-25,000001,Vente,195000,,,COURS,B018,24140,24414,Saint-Georges-de-Montclard,24,,,244140000C1076,,,,,,,,,,,,,0,,,,,T,terres,,,99,0.633287,44.930141
2020-280433,2020-09-25,000001,Vente,195000,466,,IMP DE LA RUCHELLE,0600,24140,24414,Saint-Georges-de-Montclard,24,,,244140000C1077,,,,,,,,,,,,,0,1,Maison,67,3,S,sols,,,800,0.634039,44.930114
2020-280433,2020-09-25,000001,Vente,195000,466,,IMP DE LA RUCHELLE,0600,24140,24414,Saint-Georges-de-Montclard,24,,,244140000C1077,,,,,,,,,,,,,0,1,Maison,67,3,T,terres,,,1425,0.634039,44.930114
2020-280482,2020-10-05,000001,Vente,175000,559,,RTE DU PUITS ANCIEN,0550,24140,24414,Saint-Georges-de-Montclard,24,,,244140000A0764,,,,,,,,,,,,,0,1,Maison,81,4,S,sols,,,800,0.614912,44.940292
2020-280482,2020-10-05,000001,Vente,175000,559,,RTE DU PUITS ANCIEN,0550,24140,24414,Saint-Georges-de-Montclard,24,,,244140000A0764,,,,,,,,,,,,,0,1,Maison,81,4,T,terres,,,4657,0.614912,44.940292
2020-280482,2020-10-05,000001,Vente,175000,559,,RTE DU PUITS ANCIEN,0550,24140,24414,Saint-Georges-de-Montclard,24,,,244140000A0764,,,,,,,,,,,,,0,1,Maison,81,4,BT,taillis simples,,,2173,0.614912,44.940292
2020-280609,2020-10-19,000001,Vente,3000,,,SAINT-GEORGES OUEST,B049,24140,24414,Saint-Georges-de-Montclard,24,,,244140000A0249,,,,,,,,,,,,,0,,,,,S,sols,,,101,0.613681,44.944893
