id_mutation,date_mutation,numero_disposition,nature_mutation,valeur_fonciere,adresse_numero,adresse_suffixe,adresse_nom_voie,adresse_code_voie,code_postal,code_commune,nom_commune,code_departement,ancien_code_commune,ancien_nom_commune,id_parcelle,ancien_id_parcelle,numero_volume,lot1_numero,lot1_surface_carrez,lot2_numero,lot2_surface_carrez,lot3_numero,lot3_surface_carrez,lot4_numero,lot4_surface_carrez,lot5_numero,lot5_surface_carrez,nombre_lots,code_type_local,type_local,surface_reelle_bati,nombre_pieces_principales,code_nature_culture,nature_culture,code_nature_culture_speciale,nature_culture_speciale,surface_terrain,longitude,latitude
2020-276746,2020-12-10,000001,Vente,350,,,LAVALLADE,B013,24320,24482,Saint-Paul-Lizonne,24,,,24482000AA0007,,,,,,,,,,,,,0,,,,,S,sols,,,25,0.276886,45.318712
2020-277348,2020-12-21,000001,Vente,265000,,,LE BOURG,B004,24320,24482,Saint-Paul-Lizonne,24,,,24482000AA0030,,,,,,,,,,,,,0,,,,,S,sols,,,95,0.279846,45.319207
2020-277348,2020-12-21,000001,Vente,265000,142,,RUE DES MARGUILLIERS,1350,24320,24482,Saint-Paul-Lizonne,24,,,24482000AA0031,,,,,,,,,,,,,0,4,Local industriel. commercial ou assimilé,750,0,S,sols,,,1087,0.280161,45.319326
2020-277348,2020-12-21,000001,Vente,265000,142,,RUE DES MARGUILLIERS,1350,24320,24482,Saint-Paul-Lizonne,24,,,24482000AA0031,,,,,,,,,,,,,0,1,Maison,61,3,S,sols,,,1087,0.280161,45.319326
2020-277348,2020-12-21,000001,Vente,265000,142,,RUE DES MARGUILLIERS,1350,24320,24482,Saint-Paul-Lizonne,24,,,24482000AA0031,,,,,,,,,,,,,0,3,Dépendance,,0,S,sols,,,1087,0.280161,45.319326
2020-277348,2020-12-21,000001,Vente,265000,142,,RUE DES MARGUILLIERS,1350,24320,24482,Saint-Paul-Lizonne,24,,,24482000AA0031,,,,,,,,,,,,,0,4,Local industriel. commercial ou assimilé,156,0,S,sols,,,1087,0.280161,45.319326
2020-277348,2020-12-21,000001,Vente,265000,,,LE BOURG,B004,24320,24482,Saint-Paul-Lizonne,24,,,24482000AA0073,,,,,,,,,,,,,0,,,,,P,prés,,,885,0.280157,45.318951
2020-280909,2020-02-18,000001,Vente,55000,15,,RUE CHATAIGNERE,0920,24320,24482,Saint-Paul-Lizonne,24,,,24482000ZI0048,,,,,,,,,,,,,0,1,Maison,98,4,S,sols,,,780,0.284638,45.303729
2020-280974,2020-02-18,000001,Vente,16480,,,LE BOURG,B004,24320,24482,Saint-Paul-Lizonne,24,,,24482000ZE0216,,,,,,,,,,,,,0,,,,,T,terres,,,766,0.280263,45.321445
2020-280974,2020-02-18,000001,Vente,16480,,,LE BOURG,B004,24320,24482,Saint-Paul-Lizonne,24,,,24482000ZE0218,,,,,,,,,,,,,0,,,,,T,terres,,,900,0.280291,45.321597
2020-280974,2020-02-18,000001,Vente,16480,,,LE BOURG,B004,24320,24482,Saint-Paul-Lizonne,24,,,24482000ZE0219,,,,,,,,,,,,,0,,,,,T,terres,,,1630,0.280237,45.321795
2020-281176,2020-05-26,000001,Vente,95000,157,,CHE DES HUPPES,1180,24320,24482,Saint-Paul-Lizonne,24,,,24482000ZC0103,,,,,,,,,,,,,0,1,Maison,70,3,J,jardins,,,1030,0.282981,45.332471
2020-281176,2020-05-26,000001,Vente,95000,157,,CHE DES HUPPES,1180,24320,24482,Saint-Paul-Lizonne,24,,,24482000ZC0103,,,,,,,,,,,,,0,1,Maison,70,3,P,prés,,,3368,0.282981,45.332471
2020-281176,2020-05-26,000001,Vente,95000,157,,CHE DES HUPPES,1180,24320,24482,Saint-Paul-Lizonne,24,,,24482000ZC0103,,,,,,,,,,,,,0,1,Maison,70,3,S,sols,,,560,0.282981,45.332471
2020-281188,2020-05-20,000001,Vente,190000,317,,IMP DU MAS DU BOST,1380,24320,24482,Saint-Paul-Lizonne,24,,,24482000ZH0075,,,,,,,,,,,,,0,1,Maison,88,3,T,terres,,,32027,0.286755,45.312705
2020-281188,2020-05-20,000001,Vente,190000,317,,IMP DU MAS DU BOST,1380,24320,24482,Saint-Paul-Lizonne,24,,,24482000ZH0075,,,,,,,,,,,,,0,1,Maison,88,3,T,terres,,,16013,0.286755,45.312705
2020-281188,2020-05-20,000001,Vente,190000,317,,IMP DU MAS DU BOST,1380,24320,24482,Saint-Paul-Lizonne,24,,,24482000ZH0075,,,,,,,,,,,,,0,1,Maison,88,3,S,sols,,,4760,0.286755,45.312705
2020-281188,2020-05-20,000001,Vente,190000,317,,IMP DU MAS DU BOST,1380,24320,24482,Saint-Paul-Lizonne,24,,,24482000ZH0075,,,,,,,,,,,,,0,1,Maison,88,3,VE,vergers,NOYER,Noyeraie ou noyers,2900,0.286755,45.312705
2020-281188,2020-05-20,000001,Vente,190000,317,,IMP DU MAS DU BOST,1380,24320,24482,Saint-Paul-Lizonne,24,,,24482000ZH0075,,,,,,,,,,,,,0,1,Maison,88,3,P,prés,,,23250,0.286755,45.312705
2020-281188,2020-05-20,000001,Vente,190000,317,,IMP DU MAS DU BOST,1380,24320,24482,Saint-Paul-Lizonne,24,,,24482000ZH0075,,,,,,,,,,,,,0,1,Maison,88,3,T,terres,,,13140,0.286755,45.312705
2020-281188,2020-05-20,000001,Vente,190000,317,,IMP DU MAS DU BOST,1380,24320,24482,Saint-Paul-Lizonne,24,,,24482000ZH0075,,,,,,,,,,,,,0,1,Maison,88,3,P,prés,,,7750,0.286755,45.312705
2020-281188,2020-05-20,000001,Vente,190000,317,,IMP DU MAS DU BOST,1380,24320,24482,Saint-Paul-Lizonne,24,,,24482000ZH0075,,,,,,,,,,,,,0,1,Maison,88,3,P,prés,,,5700,0.286755,45.312705
2020-281188,2020-05-20,000001,Vente,190000,317,,IMP DU MAS DU BOST,1380,24320,24482,Saint-Paul-Lizonne,24,,,24482000ZH0075,,,,,,,,,,,,,0,1,Maison,88,3,T,terres,,,13140,0.286755,45.312705
2020-281188,2020-05-20,000001,Vente,190000,,,LE MAINE NEUF,B015,24320,24482,Saint-Paul-Lizonne,24,,,24482000ZH0127,,,,,,,,,,,,,0,,,,,T,terres,,,81534,0.284436,45.311026
2020-281233,2020-05-29,000001,Vente,155660,59,,IMP DE L ECLUSE,1030,24320,24482,Saint-Paul-Lizonne,24,,,24482000ZD0056,,,,,,,,,,,,,0,1,Maison,80,5,S,sols,,,1100,0.271789,45.326027
2020-281552,2020-08-13,000001,Vente,136091,145,,IMP LOPTE,1310,24320,24482,Saint-Paul-Lizonne,24,,,24482000ZE0154,,,3,,,,,,,,,,1,1,Maison,120,5,,,,,,0.279583,45.320995
2020-281558,2020-08-19,000002,Vente,350,,,LE MAINE NEUF,B015,24320,24482,Saint-Paul-Lizonne,24,,,24482000ZH0133,,,,,,,,,,,,,0,,,,,P,prés,,,813,0.28768,45.313405
2020-281558,2020-08-19,000002,Vente,350,,,LE MAINE NEUF,B015,24320,24482,Saint-Paul-Lizonne,24,,,24482000ZH0134,,,,,,,,,,,,,0,,,,,P,prés,,,8572,0.286544,45.31355
2020-281626,2020-09-01,000001,Vente,95000,933,,RTE DU DOCTEUR GAILLARD,1000,24320,24482,Saint-Paul-Lizonne,24,,,24482000ZH0057,,,,,,,,,,,,,0,1,Maison,130,4,J,jardins,,,800,0.289786,45.314345
2020-281626,2020-09-01,000001,Vente,95000,933,,RTE DU DOCTEUR GAILLARD,1000,24320,24482,Saint-Paul-Lizonne,24,,,24482000ZH0057,,,,,,,,,,,,,0,1,Maison,130,4,AG,terrains d'agrément,,,740,0.289786,45.314345
2020-281626,2020-09-01,000001,Vente,95000,933,,RTE DU DOCTEUR GAILLARD,1000,24320,24482,Saint-Paul-Lizonne,24,,,24482000ZH0057,,,,,,,,,,,,,0,1,Maison,130,4,S,sols,,,800,0.289786,45.314345
2020-281688,2020-09-17,000001,Vente,17000,,,TOURNEFERIE NORD,B038,24320,24482,Saint-Paul-Lizonne,24,,,24482000ZI0045,,,,,,,,,,,,,0,,,,,T,terres,,,4020,0.28512,45.304214
2020-281688,2020-09-17,000001,Vente,17000,,,TOURNEFERIE NORD,B038,24320,24482,Saint-Paul-Lizonne,24,,,24482000ZI0045,,,,,,,,,,,,,0,,,,,S,sols,,,100,0.28512,45.304214
2020-281756,2020-10-05,000001,Vente,6000,,,LAVALLADE,B013,24320,24482,Saint-Paul-Lizonne,24,,,24482000ZE0124,,,,,,,,,,,,,0,,,,,E,eaux,,,8570,0.271167,45.321356
2020-281756,2020-10-05,000001,Vente,6000,,,LAVALLADE,B013,24320,24482,Saint-Paul-Lizonne,24,,,24482000ZE0124,,,,,,,,,,,,,0,,,,,P,prés,,,4844,0.271167,45.321356
2020-281756,2020-10-05,000001,Vente,6000,,,LAVALLADE,B013,24320,24482,Saint-Paul-Lizonne,24,,,24482000ZE0124,,,,,,,,,,,,,0,,,,,BT,taillis simples,,,1380,0.271167,45.321356
2020-281756,2020-10-05,000001,Vente,6000,,,LAVALLADE,B013,24320,24482,Saint-Paul-Lizonne,24,,,24482000ZE0125,,,,,,,,,,,,,0,,,,,P,prés,,,546,0.270769,45.320716
2020-281803,2020-10-07,000001,Vente,10000,,,LES CAILLOUX,B005,24320,24482,Saint-Paul-Lizonne,24,,,24482000ZK0009,,,,,,,,,,,,,0,,,,,T,terres,,,1340,0.281383,45.302865
2020-281849,2020-10-16,000001,Vente,340000,282,,CHE DES TOURBIERES,1640,24320,24482,Saint-Paul-Lizonne,24,,,24482000ZE0072,,,,,,,,,,,,,0,1,Maison,238,7,E,eaux,,,7150,0.271487,45.322513
2020-281849,2020-10-16,000001,Vente,340000,282,,CHE DES TOURBIERES,1640,24320,24482,Saint-Paul-Lizonne,24,,,24482000ZE0072,,,,,,,,,,,,,0,1,Maison,238,7,S,sols,,,400,0.271487,45.322513
2020-281849,2020-10-16,000001,Vente,340000,282,,CHE DES TOURBIERES,1640,24320,24482,Saint-Paul-Lizonne,24,,,24482000ZE0072,,,,,,,,,,,,,0,1,Maison,238,7,P,prés,,,6970,0.271487,45.322513
2020-281849,2020-10-16,000001,Vente,340000,144,A,CHATILLON SUD,B028,24320,24482,Saint-Paul-Lizonne,24,,,24482000ZE0073,,,,,,,,,,,,,0,3,Dépendance,,0,P,prés,,,3120,0.272693,45.322345
2020-281849,2020-10-16,000001,Vente,340000,144,A,CHATILLON SUD,B028,24320,24482,Saint-Paul-Lizonne,24,,,24482000ZE0073,,,,,,,,,,,,,0,3,Dépendance,,0,S,sols,,,100,0.272693,45.322345
