id_mutation,date_mutation,numero_disposition,nature_mutation,valeur_fonciere,adresse_numero,adresse_suffixe,adresse_nom_voie,adresse_code_voie,code_postal,code_commune,nom_commune,code_departement,ancien_code_commune,ancien_nom_commune,id_parcelle,ancien_id_parcelle,numero_volume,lot1_numero,lot1_surface_carrez,lot2_numero,lot2_surface_carrez,lot3_numero,lot3_surface_carrez,lot4_numero,lot4_surface_carrez,lot5_numero,lot5_surface_carrez,nombre_lots,code_type_local,type_local,surface_reelle_bati,nombre_pieces_principales,code_nature_culture,nature_culture,code_nature_culture_speciale,nature_culture_speciale,surface_terrain,longitude,latitude
2020-275685,2020-11-16,000001,Vente,220000,270,,LA GUIONIE,B068,24600,24586,Villetoureix,24,,,245860000B0087,,,,,,,,,,,,,0,1,Maison,106,4,S,sols,,,268,0.38007,45.273533
2020-275685,2020-11-16,000001,Vente,220000,,,LA GUIONIE,B068,24600,24586,Villetoureix,24,,,245860000B0088,,,,,,,,,,,,,0,,,,,J,jardins,,,1088,0.380132,45.27372
2020-276435,2020-12-03,000001,Vente,16000,,,LA BORIE OUEST,B012,24600,24586,Villetoureix,24,,,245860000E0800,,,,,,,,,,,,,0,,,,,AB,terrains a bâtir,,,2151,0.342171,45.264113
2020-280856,2020-02-12,000002,Vente,895,,,LE BOURG,B018,24600,24586,Villetoureix,24,,,245860000C0924,,,,,,,,,,,,,0,,,,,J,jardins,,,123,0.362103,45.262862
2020-280856,2020-02-12,000002,Vente,895,,,LE BOURG,B018,24600,24586,Villetoureix,24,,,245860000C0926,,,,,,,,,,,,,0,,,,,J,jardins,,,91,0.362076,45.262962
2020-280856,2020-02-12,000003,Vente,895,,,LE BOURG,B018,24600,24586,Villetoureix,24,,,245860000C0234,,,,,,,,,,,,,0,,,,,J,jardins,,,214,0.362189,45.262793
2020-281010,2020-02-29,000001,Vente,100,,,A LA CROUZILLE,B047,24600,24586,Villetoureix,24,,,245860000A0018,,,,,,,,,,,,,0,,,,,BT,taillis simples,,,384,0.358755,45.286275
2020-281166,2020-05-06,000001,Vente,117143,1029,,CHEZ VARAILHON,B039,24600,24586,Villetoureix,24,,,245860000D0848,,,,,,,,,,,,,0,1,Maison,253,8,S,sols,,,1790,0.360406,45.262845
2020-281166,2020-05-06,000001,Vente,117143,,,CHEZ VARAILHON,B039,24600,24586,Villetoureix,24,,,245860000D0851,,,,,,,,,,,,,0,,,,,P,prés,,,1840,0.360653,45.262551
2020-281166,2020-05-06,000001,Vente,117143,,,CHEZ VARAILHON,B039,24600,24586,Villetoureix,24,,,245860000D1482,,,,,,,,,,,,,0,,,,,T,terres,,,1920,0.360285,45.26308
2020-281166,2020-05-06,000001,Vente,117143,,,CHEZ VARAILHON,B039,24600,24586,Villetoureix,24,,,245860000D1629,,,,,,,,,,,,,0,,,,,P,prés,,,270,0.360143,45.262648
2020-281166,2020-05-06,000001,Vente,117143,,,CHEZ VARAILHON,B039,24600,24586,Villetoureix,24,,,245860000D1713,,,,,,,,,,,,,0,,,,,S,sols,,,30,0.360697,45.263022
2020-281166,2020-05-06,000001,Vente,117143,,,CHEZ VARAILHON,B039,24600,24586,Villetoureix,24,,,245860000D1837,,,,,,,,,,,,,0,,,,,T,terres,,,178,0.359923,45.263032
2020-281225,2020-05-29,000001,Vente,90000,158,A,PUY TUTAUD,B104,24600,24586,Villetoureix,24,,,245860000E0390,,,,,,,,,,,,,0,1,Maison,107,4,S,sols,,,1480,0.341873,45.268525
2020-281225,2020-05-29,000001,Vente,90000,158,A,PUY TUTAUD,B104,24600,24586,Villetoureix,24,,,245860000E0390,,,,,,,,,,,,,0,1,Maison,107,4,J,jardins,,,1257,0.341873,45.268525
2020-281244,2020-05-22,000001,Vente,154205,,,LA VIGERIE,B125,24600,24586,Villetoureix,24,,,245860000D0890,,,,,,,,,,,,,0,,,,,P,prés,,,653,0.35463,45.266839
2020-281244,2020-05-22,000001,Vente,154205,46,A,LA VIGERIE,B125,24600,24586,Villetoureix,24,,,245860000D0891,,,,,,,,,,,,,0,1,Maison,16,1,S,sols,,,249,0.354242,45.266613
2020-281244,2020-05-22,000001,Vente,154205,46,,LA VIGERIE,B125,24600,24586,Villetoureix,24,,,245860000D1226,,,,,,,,,,,,,0,1,Maison,131,4,S,sols,,,1252,0.354155,45.266753
2020-281244,2020-05-22,000001,Vente,154205,,,LA VIGERIE,B125,24600,24586,Villetoureix,24,,,245860000D2043,,,,,,,,,,,,,0,,,,,P,prés,,,77,0.35403,45.267281
2020-281244,2020-05-22,000001,Vente,154205,,,LA VIGERIE,B125,24600,24586,Villetoureix,24,,,245860000D2047,,,,,,,,,,,,,0,,,,,P,prés,,,1527,0.354261,45.267091
2020-281244,2020-05-22,000001,Vente,154205,,,LA VIGERIE,B125,24600,24586,Villetoureix,24,,,245860000D2047,,,,,,,,,,,,,0,,,,,P,prés,,,1526,0.354261,45.267091
2020-281333,2020-06-02,000001,Vente,158000,,,LA COURBERIE,B044,24600,24586,Villetoureix,24,,,245860000B0660,,,,,,,,,,,,,0,,,,,AG,terrains d'agrément,,,662,0.386552,45.266786
2020-281333,2020-06-02,000001,Vente,158000,1180,,LA COURBERIE,B044,24600,24586,Villetoureix,24,,,245860000B0662,,,,,,,,,,,,,0,1,Maison,91,4,S,sols,,,800,0.386857,45.266617
2020-281333,2020-06-02,000001,Vente,158000,1180,,LA COURBERIE,B044,24600,24586,Villetoureix,24,,,245860000B0662,,,,,,,,,,,,,0,1,Maison,91,4,AG,terrains d'agrément,,,865,0.386857,45.266617
2020-281387,2020-06-26,000002,Vente,15000,,,LA BORIE,B011,24600,24586,Villetoureix,24,,,245860000D2211,,,,,,,,,,,,,0,,,,,P,prés,,,929,0.345433,45.263781
2020-281466,2020-07-17,000001,Vente,180000,,,AUX DEUX PONTS,B049,24600,24586,Villetoureix,24,,,245860000D1158,,,,,,,,,,,,,0,,,,,S,sols,,,475,0.343039,45.256463
2020-281466,2020-07-17,000001,Vente,180000,,,AUX DEUX PONTS,B049,24600,24586,Villetoureix,24,,,245860000D1159,,,,,,,,,,,,,0,,,,,S,sols,,,206,0.343002,45.256753
2020-281466,2020-07-17,000001,Vente,180000,9000,,AUX DEUX PONTS,B049,24600,24586,Villetoureix,24,,,245860000D1175,,,,,,,,,,,,,0,4,Local industriel. commercial ou assimilé,322,0,S,sols,,,253,0.342874,45.256514
2020-281466,2020-07-17,000001,Vente,180000,,,AUX DEUX PONTS,B049,24600,24586,Villetoureix,24,,,245860000D1585,,,,,,,,,,,,,0,,,,,P,prés,,,765,0.343234,45.256489
2020-281569,2020-06-05,000001,Vente,80000,135,,LA BORIE,B011,24600,24586,Villetoureix,24,,,245860000D0941,,,,,,,,,,,,,0,1,Maison,76,4,S,sols,,,352,0.343004,45.262159
2020-281569,2020-06-05,000001,Vente,80000,135,,LA BORIE,B011,24600,24586,Villetoureix,24,,,245860000D0941,,,,,,,,,,,,,0,1,Maison,30,1,S,sols,,,352,0.343004,45.262159
2020-281569,2020-06-05,000001,Vente,80000,135,,LA BORIE,B011,24600,24586,Villetoureix,24,,,245860000D0941,,,,,,,,,,,,,0,1,Maison,80,4,S,sols,,,352,0.343004,45.262159
2020-281569,2020-06-05,000001,Vente,80000,135,,LA BORIE,B011,24600,24586,Villetoureix,24,,,245860000D0941,,,,,,,,,,,,,0,1,Maison,158,5,S,sols,,,352,0.343004,45.262159
2020-281576,2020-08-20,000001,Vente,20000,82,,LA POUYADE,B092,24600,24586,Villetoureix,24,,,245860000C0734,,,,,,,,,,,,,0,1,Maison,72,3,S,sols,,,158,0.36427,45.26735
2020-281598,2020-08-28,000001,Vente,122000,,,CHEZ TUTAUD OUEST,B038,24600,24586,Villetoureix,24,,,245860000E0392,,,,,,,,,,,,,0,,,,,T,terres,,,549,0.342424,45.267872
2020-281598,2020-08-28,000001,Vente,122000,,,CHEZ TUTAUD OUEST,B038,24600,24586,Villetoureix,24,,,245860000E0392,,,,,,,,,,,,,0,,,,,S,sols,,,128,0.342424,45.267872
2020-281598,2020-08-28,000001,Vente,122000,157,,CHEZ TUTAUD OUEST,B038,24600,24586,Villetoureix,24,,,245860000E0393,,,,,,,,,,,,,0,1,Maison,80,3,S,sols,,,218,0.342539,45.267599
2020-281598,2020-08-28,000001,Vente,122000,,,CHEZ TUTAUD OUEST,B038,24600,24586,Villetoureix,24,,,245860000E1152,,,,,,,,,,,,,0,,,,,T,terres,,,135,0.342416,45.267659
2020-281602,2020-08-31,000001,Vente,130000,41,A,BONAFON,B009,24600,24586,Villetoureix,24,,,245860000D1465,,,,,,,,,,,,,0,4,Local industriel. commercial ou assimilé,1240,0,S,sols,,,1505,0.349929,45.262422
2020-281602,2020-08-31,000001,Vente,130000,,,BONAFON,B009,24600,24586,Villetoureix,24,,,245860000D1578,,,,,,,,,,,,,0,,,,,S,sols,,,768,0.350143,45.262408
2020-281703,2020-09-18,000001,Vente,101000,,,LA GUIONIE,B068,24600,24586,Villetoureix,24,,,245860000B0089,,,,,,,,,,,,,0,,,,,P,prés,,,841,0.379746,45.27365
2020-281703,2020-09-18,000001,Vente,101000,269,,LA GUIONIE,B068,24600,24586,Villetoureix,24,,,245860000B0090,,,,,,,,,,,,,0,1,Maison,57,2,S,sols,,,347,0.379778,45.273481
2020-281796,2020-09-23,000001,Vente,273000,,,LA HAUTE RIGALE,B069,24600,24586,Villetoureix,24,,,245860000B0799,,,,,,,,,,,,,0,,,,,P,prés,,,230,0.376163,45.265167
2020-281796,2020-09-23,000001,Vente,273000,1174,,LA HAUTE RIGALE,B069,24600,24586,Villetoureix,24,,,245860000B0801,,,,,,,,,,,,,0,1,Maison,215,3,S,sols,,,505,0.376383,45.265245
2020-281796,2020-09-23,000001,Vente,273000,,,LA HAUTE RIGALE,B069,24600,24586,Villetoureix,24,,,245860000B0803,,,,,,,,,,,,,0,,,,,L,landes,,,3462,0.376338,45.265458
2020-281796,2020-09-23,000001,Vente,273000,,,LA HAUTE RIGALE,B069,24600,24586,Villetoureix,24,,,245860000B0805,,,,,,,,,,,,,0,,,,,T,terres,,,808,0.376718,45.265431
