id_mutation,date_mutation,numero_disposition,nature_mutation,valeur_fonciere,adresse_numero,adresse_suffixe,adresse_nom_voie,adresse_code_voie,code_postal,code_commune,nom_commune,code_departement,ancien_code_commune,ancien_nom_commune,id_parcelle,ancien_id_parcelle,numero_volume,lot1_numero,lot1_surface_carrez,lot2_numero,lot2_surface_carrez,lot3_numero,lot3_surface_carrez,lot4_numero,lot4_surface_carrez,lot5_numero,lot5_surface_carrez,nombre_lots,code_type_local,type_local,surface_reelle_bati,nombre_pieces_principales,code_nature_culture,nature_culture,code_nature_culture_speciale,nature_culture_speciale,surface_terrain,longitude,latitude
2020-303416,2020-09-25,000001,Vente,70000,5026,,LE VILLAGE,B065,26460,26060,Bouvières,26,,,26060000AB0063,,,,,,,,,,,,,0,1,Maison,76,1,S,sols,,,145,5.215883,44.516542
2020-305065,2020-10-30,000001,Vente,85500,5038,,LE VILLAGE,B065,26460,26060,Bouvières,26,,,26060000AB0078,,,,,,,,,,,,,0,1,Maison,56,2,S,sols,,,65,5.215598,44.516226
2020-306101,2020-11-19,000001,Vente,110000,5049,,LE VILLAGE,B065,26460,26060,Bouvières,26,,,26060000AB0093,,,,,,,,,,,,,0,2,Appartement,30,2,S,sols,,,57,5.215563,44.515681
2020-306101,2020-11-19,000001,Vente,110000,5049,,LE VILLAGE,B065,26460,26060,Bouvières,26,,,26060000AB0093,,,,,,,,,,,,,0,2,Appartement,30,1,S,sols,,,57,5.215563,44.515681
2020-306101,2020-11-19,000001,Vente,110000,5049,,LE VILLAGE,B065,26460,26060,Bouvières,26,,,26060000AB0093,,,,,,,,,,,,,0,3,Dépendance,,0,S,sols,,,57,5.215563,44.515681
2020-306101,2020-11-19,000001,Vente,110000,,,LE VILLAGE,B065,26460,26060,Bouvières,26,,,26060000AB0167,,,,,,,,,,,,,0,,,,,S,sols,,,106,5.215563,44.515615
2020-306623,2020-12-07,000001,Vente,180000,5042,,LE VILLAGE,B065,26460,26060,Bouvières,26,,,26060000AB0082,,,,,,,,,,,,,0,1,Maison,125,7,S,sols,,,150,5.215682,44.516
2020-306623,2020-12-07,000001,Vente,180000,5042,,LE VILLAGE,B065,26460,26060,Bouvières,26,,,26060000AB0082,,,,,,,,,,,,,0,4,Local industriel. commercial ou assimilé,16,0,S,sols,,,150,5.215682,44.516
2020-306623,2020-12-07,000001,Vente,180000,5042,,LE VILLAGE,B065,26460,26060,Bouvières,26,,,26060000AB0082,,,,,,,,,,,,,0,4,Local industriel. commercial ou assimilé,26,0,S,sols,,,150,5.215682,44.516
2020-306623,2020-12-07,000001,Vente,180000,5043,,LE VILLAGE,B065,26460,26060,Bouvières,26,,,26060000AB0084,,,,,,,,,,,,,0,1,Maison,85,3,S,sols,,,75,5.215608,44.515921
2020-306623,2020-12-07,000001,Vente,180000,5002,,LE VILLAGE,B065,26460,26060,Bouvières,26,,,26060000AB0175,,,,,,,,,,,,,0,3,Dépendance,,0,S,sols,,,78,5.214705,44.515692
2020-306623,2020-12-07,000001,Vente,180000,5002,,LE VILLAGE,B065,26460,26060,Bouvières,26,,,26060000AB0175,,,,,,,,,,,,,0,3,Dépendance,,0,S,sols,,,78,5.214705,44.515692
