id_mutation,date_mutation,numero_disposition,nature_mutation,valeur_fonciere,adresse_numero,adresse_suffixe,adresse_nom_voie,adresse_code_voie,code_postal,code_commune,nom_commune,code_departement,ancien_code_commune,ancien_nom_commune,id_parcelle,ancien_id_parcelle,numero_volume,lot1_numero,lot1_surface_carrez,lot2_numero,lot2_surface_carrez,lot3_numero,lot3_surface_carrez,lot4_numero,lot4_surface_carrez,lot5_numero,lot5_surface_carrez,nombre_lots,code_type_local,type_local,surface_reelle_bati,nombre_pieces_principales,code_nature_culture,nature_culture,code_nature_culture_speciale,nature_culture_speciale,surface_terrain,longitude,latitude
2020-452364,2020-02-18,000001,Vente,38775,,,MANGAUD,B045,33710,33500,Samonac,33,,,335000000A1472,,,,,,,,,,,,,0,,,,,AB,terrains a bâtir,,,15,-0.579146,45.071779
2020-452364,2020-02-18,000001,Vente,38775,,,MANGAUD,B045,33710,33500,Samonac,33,,,335000000A1476,,,,,,,,,,,,,0,,,,,AB,terrains a bâtir,,,690,-0.579237,45.071669
2020-452462,2020-02-27,000001,Vente,130000,8,,RUE DE FONTVIEL,0350,33710,33500,Samonac,33,,,335000000A1129,,,,,,,,,,,,,0,1,Maison,47,3,S,sols,,,181,-0.575301,45.081518
2020-452462,2020-02-27,000001,Vente,130000,,,FONVIEL,B032,33710,33500,Samonac,33,,,335000000A1179,,,,,,,,,,,,,0,,,,,AB,terrains a bâtir,,,45,-0.575079,45.081571
2020-452462,2020-02-27,000001,Vente,130000,,,FONVIEL,B032,33710,33500,Samonac,33,,,335000000A1304,,,,,,,,,,,,,0,,,,,S,sols,,,80,-0.575334,45.081644
2020-452462,2020-02-27,000001,Vente,130000,,,FONVIEL,B032,33710,33500,Samonac,33,,,335000000A1306,,,,,,,,,,,,,0,,,,,T,terres,,,66,-0.575225,45.081623
2020-452462,2020-02-27,000001,Vente,130000,,,FONVIEL,B032,33710,33500,Samonac,33,,,335000000A1308,,,,,,,,,,,,,0,,,,,AB,terrains a bâtir,,,36,-0.575092,45.081592
2020-452762,2020-03-13,000001,Vente,55165,,,MANGAUD,B045,33710,33500,Samonac,33,,,335000000A1470,,,,,,,,,,,,,0,,,,,AB,terrains a bâtir,,,242,-0.57891,45.071941
2020-452762,2020-03-13,000001,Vente,55165,,,MANGAUD,B045,33710,33500,Samonac,33,,,335000000A1473,,,,,,,,,,,,,0,,,,,AB,terrains a bâtir,,,575,-0.578858,45.071836
2020-452762,2020-03-13,000001,Vente,55165,,,MANGAUD,B045,33710,33500,Samonac,33,,,335000000A1477,,,,,,,,,,,,,0,,,,,AB,terrains a bâtir,,,41,-0.578817,45.071757
2020-452762,2020-03-13,000001,Vente,55165,,,MANGAUD,B045,33710,33500,Samonac,33,,,335000000A1482,,,,,,,,,,,,,0,,,,,AB,terrains a bâtir,,,145,-0.578687,45.072016
2020-452974,2020-04-08,000001,Vente,4763.5,,,BARRIEU,B004,33710,33500,Samonac,33,,,335000000A0018,,,,,,,,,,,,,0,,,,,T,terres,,,6605,-0.580928,45.067739
2020-452974,2020-04-08,000001,Vente,4763.5,,,BARRIEU,B004,33710,33500,Samonac,33,,,335000000A0018,,,,,,,,,,,,,0,,,,,VI,vignes,,,200,-0.580928,45.067739
2020-453147,2020-05-04,000001,Vente,16250,,,TOURTEAU,B072,33710,33500,Samonac,33,,,335000000B0842,,,,,,,,,,,,,0,,,,,AB,terrains a bâtir,,,250,-0.572062,45.067288
2020-453147,2020-05-04,000001,Vente,16250,,,TOURTEAU,B072,33710,33500,Samonac,33,,,335000000B0844,,,,,,,,,,,,,0,,,,,AB,terrains a bâtir,,,268,-0.572033,45.067449
2020-453147,2020-05-04,000002,Vente,16250,,,TOURTEAU,B072,33710,33500,Samonac,33,,,335000000B0841,,,,,,,,,,,,,0,,,,,AB,terrains a bâtir,,,433,-0.57217,45.06762
2020-453147,2020-05-04,000002,Vente,16250,,,TOURTEAU,B072,33710,33500,Samonac,33,,,335000000B0843,,,,,,,,,,,,,0,,,,,AB,terrains a bâtir,,,85,-0.57209,45.067637
2020-453167,2020-05-05,000001,Vente,47630,,,MANGAUD,B045,33710,33500,Samonac,33,,,335000000A1468,,,,,,,,,,,,,0,,,,,AB,terrains a bâtir,,,723,-0.579504,45.071784
2020-453167,2020-05-05,000001,Vente,47630,,,MANGAUD,B045,33710,33500,Samonac,33,,,335000000A1479,,,,,,,,,,,,,0,,,,,AB,terrains a bâtir,,,143,-0.579493,45.071704
2020-453828,2020-06-18,000001,Vente,288000,,,FONVIEL,B032,33710,33500,Samonac,33,,,335000000A0630,,,,,,,,,,,,,0,,,,,AG,terrains d'agrément,,,1930,-0.57474,45.081
2020-453828,2020-06-18,000001,Vente,288000,4,,RUE DE FONTVIEL,0350,33710,33500,Samonac,33,,,335000000A0631,,,,,,,,,,,,,0,1,Maison,220,8,S,sols,,,1610,-0.575274,45.081136
2020-453828,2020-06-18,000001,Vente,288000,,,FONVIEL,B032,33710,33500,Samonac,33,,,335000000A0634,,,,,,,,,,,,,0,,,,,BT,taillis simples,CHAT,Châtaigneraie,940,-0.57496,45.082114
2020-453828,2020-06-18,000001,Vente,288000,,,FONVIEL,B032,33710,33500,Samonac,33,,,335000000A0827,,,,,,,,,,,,,0,,,,,AG,terrains d'agrément,,,1010,-0.575062,45.080881
2020-453828,2020-06-18,000001,Vente,288000,,,FONVIEL,B032,33710,33500,Samonac,33,,,335000000A1056,,,,,,,,,,,,,0,,,,,P,prés,,,792,-0.574338,45.081305
2020-453828,2020-06-18,000001,Vente,288000,,,FONVIEL,B032,33710,33500,Samonac,33,,,335000000A1056,,,,,,,,,,,,,0,,,,,S,sols,,,20,-0.574338,45.081305
2020-453828,2020-06-18,000001,Vente,288000,,,FONVIEL,B032,33710,33500,Samonac,33,,,335000000A1057,,,,,,,,,,,,,0,,,,,P,prés,,,178,-0.574248,45.08106
2020-453828,2020-06-18,000001,Vente,288000,,,FONVIEL,B032,33710,33500,Samonac,33,,,335000000A1183,,,,,,,,,,,,,0,,,,,P,prés,,,30,-0.574788,45.081455
2020-453828,2020-06-18,000001,Vente,288000,,,FONVIEL,B032,33710,33500,Samonac,33,,,335000000A1184,,,,,,,,,,,,,0,,,,,VI,vignes,,,1303,-0.574653,45.081464
2020-454253,2020-07-16,000001,Vente,150000,9,,RTE DES CHATEAUX,0120,33710,33500,Samonac,33,,,335000000A0440,,,,,,,,,,,,,0,1,Maison,136,6,S,sols,,,1943,-0.580734,45.076775
2020-454739,2020-06-04,000002,Echange,500,,,LA JAUGUE,B039,33710,33500,Samonac,33,,,335000000A1493,,,,,,,,,,,,,0,,,,,VI,vignes,,,222,-0.567842,45.082746
2020-454739,2020-06-04,000002,Echange,500,,,LA JAUGUE,B039,33710,33500,Samonac,33,,,335000000A1494,,,,,,,,,,,,,0,,,,,VI,vignes,,,12,-0.567745,45.08272
2020-455282,2020-09-28,000001,Vente,80000,,,AUX CASTENETS,B021,33710,33500,Samonac,33,,,335000000A0560,,,,,,,,,,,,,0,,,,,J,jardins,,,980,-0.578737,45.080767
2020-455282,2020-09-28,000001,Vente,80000,3,,RUE DE FONTVIEL,0350,33710,33500,Samonac,33,,,335000000A0575,,,,,,,,,,,,,0,3,Dépendance,,0,S,sols,,,711,-0.575797,45.081242
2020-455282,2020-09-28,000001,Vente,80000,,,FONVIEL,B032,33710,33500,Samonac,33,,,335000000A0577,,,,,,,,,,,,,0,,,,,T,terres,,,2055,-0.575902,45.08092
2020-455282,2020-09-28,000001,Vente,80000,,,FONVIEL,B032,33710,33500,Samonac,33,,,335000000A0578,,,,,,,,,,,,,0,,,,,T,terres,,,1090,-0.575871,45.080594
2020-455452,2020-10-07,000001,Vente,46860,,,MANGAUD,B045,33710,33500,Samonac,33,,,335000000A1467,,,,,,,,,,,,,0,,,,,AB,terrains a bâtir,,,852,-0.579339,45.071973
2020-455592,2020-10-16,000001,Vente,41360,,,MANGAUD,B045,33710,33500,Samonac,33,,,335000000A1466,,,,,,,,,,,,,0,,,,,AB,terrains a bâtir,,,752,-0.579219,45.072189
2020-456955,2020-12-21,000001,Vente,100000,6,,RUE DE FONTVIEL,0350,33710,33500,Samonac,33,,,335000000A1178,,,,,,,,,,,,,0,1,Maison,60,2,S,sols,,,704,-0.575208,45.081439
2020-456955,2020-12-21,000001,Vente,100000,,,FONVIEL,B032,33710,33500,Samonac,33,,,335000000A1182,,,,,,,,,,,,,0,,,,,P,prés,,,761,-0.574862,45.081617
2020-456955,2020-12-21,000001,Vente,100000,,,FONVIEL,B032,33710,33500,Samonac,33,,,335000000A1185,,,,,,,,,,,,,0,,,,,VI,vignes,,,17,-0.574665,45.08168
2020-457006,2020-12-29,000001,Vente,45485,,,MANGAUD,B045,33710,33500,Samonac,33,,,335000000A1465,,,,,,,,,,,,,0,,,,,AB,terrains a bâtir,,,775,-0.578977,45.07235
2020-457006,2020-12-29,000001,Vente,45485,,,MANGAUD,B045,33710,33500,Samonac,33,,,335000000A1480,,,,,,,,,,,,,0,,,,,AB,terrains a bâtir,,,52,-0.578855,45.072453
2020-457022,2020-12-21,000001,Vente,145400,15,,ALL DU TOURTEAU,0950,33710,33500,Samonac,33,,,335000000B0103,,,,,,,,,,,,,0,1,Maison,80,2,S,sols,,,165,-0.572684,45.066804
2020-457022,2020-12-21,000001,Vente,145400,,,TOURTEAU,B072,33710,33500,Samonac,33,,,335000000B0104,,,,,,,,,,,,,0,,,,,S,sols,,,65,-0.572437,45.066816
