id_mutation,date_mutation,numero_disposition,nature_mutation,valeur_fonciere,adresse_numero,adresse_suffixe,adresse_nom_voie,adresse_code_voie,code_postal,code_commune,nom_commune,code_departement,ancien_code_commune,ancien_nom_commune,id_parcelle,ancien_id_parcelle,numero_volume,lot1_numero,lot1_surface_carrez,lot2_numero,lot2_surface_carrez,lot3_numero,lot3_surface_carrez,lot4_numero,lot4_surface_carrez,lot5_numero,lot5_surface_carrez,nombre_lots,code_type_local,type_local,surface_reelle_bati,nombre_pieces_principales,code_nature_culture,nature_culture,code_nature_culture_speciale,nature_culture_speciale,surface_terrain,longitude,latitude
2020-605596,2020-10-26,000001,Vente,220000,13,,CHE DE GRILLET,0909,42700,42095,Firminy,42,,,42095000AB0230,,,,,,,,,,,,,0,1,Maison,96,4,S,sols,,,1068,4.290116,45.401564
2020-605643,2020-10-16,000001,Vente,75000,63,,RUE JEAN JAURES,1030,42700,42095,Firminy,42,,,42095000AT0121,,,10,152.12,11,,12,,13,,,,4,2,Appartement,152,1,,,,,,4.287023,45.389266
2020-605653,2020-10-30,000001,Vente,195000,13,,RUE TOURNANTE,1970,42700,42095,Firminy,42,,,42095000AS0090,,,,,,,,,,,,,0,1,Maison,90,4,S,sols,,,471,4.278745,45.38417
2020-605660,2020-10-23,000001,Vente,60000,13,,PL CHARLES DE GAULLE,0426,42700,42095,Firminy,42,,,42095000AT0869,,,1,,15,,,,,,,,2,2,Appartement,79,4,,,,,,4.283322,45.389557
2020-605660,2020-10-23,000001,Vente,60000,13,,PL CHARLES DE GAULLE,0426,42700,42095,Firminy,42,,,42095000AT0869,,,9,,,,,,,,,,1,3,Dépendance,,0,,,,,,4.283322,45.389557
2020-605763,2020-10-22,000001,Vente,165000,33,,BD FAYOL,0720,42700,42095,Firminy,42,,,42095000AH0732,,,,,,,,,,,,,0,4,Local industriel. commercial ou assimilé,80,0,S,sols,,,371,4.293975,45.389851
2020-605763,2020-10-22,000001,Vente,165000,33,,BD FAYOL,0720,42700,42095,Firminy,42,,,42095000AH0732,,,,,,,,,,,,,0,2,Appartement,65,3,S,sols,,,371,4.293975,45.389851
2020-605763,2020-10-22,000001,Vente,165000,33,,BD FAYOL,0720,42700,42095,Firminy,42,,,42095000AH0732,,,,,,,,,,,,,0,2,Appartement,65,3,S,sols,,,371,4.293975,45.389851
2020-605763,2020-10-22,000001,Vente,165000,33,,BD FAYOL,0720,42700,42095,Firminy,42,,,42095000AH0732,,,,,,,,,,,,,0,2,Appartement,55,2,S,sols,,,371,4.293975,45.389851
2020-605801,2020-10-12,000002,Vente,155000,2,,RUE DU CHANOINE CHAUSSE,0410,42700,42095,Firminy,42,,,42095000AE0988,,,,,,,,,,,,,0,4,Local industriel. commercial ou assimilé,757,0,S,sols,,,399,4.293118,45.392427
2020-605872,2020-11-03,000001,Vente,20000,23,,RUE DE BENAUD,0210,42700,42095,Firminy,42,,,42095000AH0411,,,,,,,,,,,,,0,1,Maison,44,2,S,sols,,,40,4.290485,45.388499
2020-605891,2020-10-26,000001,Vente,77500,37,,RUE JEAN JAURES,1030,42700,42095,Firminy,42,,,42095000AH0493,,,104,,57,84.8,,,,,,,2,2,Appartement,86,4,,,,,,4.287915,45.390197
2020-605893,2020-10-27,000002,Vente,,,,LE PINAY,B075,42700,42095,Firminy,42,,,42095000BD0330,,,,,,,,,,,,,0,,,,,P,prés,,,103,4.274125,45.3664
2020-605934,2020-10-27,000001,Vente,85000,2,B,RUE COURBON BRIOUDE,0560,42700,42095,Firminy,42,,,42095000AH0251,,,21,,28,79.36,,,,,,,2,2,Appartement,80,4,,,,,,4.2912,45.390298
2020-605934,2020-10-27,000001,Vente,85000,2,B,RUE COURBON BRIOUDE,0560,42700,42095,Firminy,42,,,42095000AH0251,,,25,,,,,,,,,,1,3,Dépendance,,0,,,,,,4.2912,45.390298
2020-605945,2020-11-03,000001,Vente,119000,16,,RUE DENFERT ROCHEREAU,0610,42700,42095,Firminy,42,,,42095000AH0221,,,,,,,,,,,,,0,2,Appartement,73,3,S,sols,,,132,4.290719,45.39056
2020-605945,2020-11-03,000001,Vente,119000,16,,RUE DENFERT ROCHEREAU,0610,42700,42095,Firminy,42,,,42095000AH0221,,,,,,,,,,,,,0,2,Appartement,143,5,S,sols,,,132,4.290719,45.39056
2020-605945,2020-11-03,000001,Vente,119000,16,,RUE DENFERT ROCHEREAU,0610,42700,42095,Firminy,42,,,42095000AH0221,,,,,,,,,,,,,0,2,Appartement,73,3,S,sols,,,132,4.290719,45.39056
2020-605946,2020-03-05,000001,Vente,150,3,,CHE DU BEAL,0200,42700,42095,Firminy,42,,,42095000AH0789,,,,,,,,,,,,,0,,,,,S,sols,,,16,4.295142,45.387911
2020-606034,2020-11-13,000001,Vente,160000,9006,,BAS DE LA COTE,B004,42700,42095,Firminy,42,,,42095000AK0202,,,8,100.22,,,,,,,,,1,1,Maison,89,4,S,sols,,,183,4.303351,45.377863
2020-606038,2020-11-03,000001,Vente,125000,1,,RUE DE L ETERNITE,0710,42700,42095,Firminy,42,,,42095000AR0646,,,212,,,,,,,,,,1,3,Dépendance,,0,,,,,,4.290031,45.38628
2020-606038,2020-11-03,000001,Vente,125000,2,,RUE BENOIT FRACHON,0215,42700,42095,Firminy,42,,,42095000AR0650,,,103,77.87,,,,,,,,,1,2,Appartement,68,3,,,,,,4.287885,45.387455
2020-606057,2020-11-03,000001,Vente,70101.15,10,,CHE DU COMBOBERT,0480,42700,42095,Firminy,42,,,42095000BC0176,,,,,,,,,,,,,0,1,Maison,60,4,S,sols,,,971,4.283824,45.367731
2020-606058,2020-10-22,000001,Vente,75000,5,,RUE LOUIS BLANC,1190,42700,42095,Firminy,42,,,42095000AH0728,,,154,,39,84.1,,,,,,,2,2,Appartement,83,4,,,,,,4.288773,45.391065
2020-606089,2020-10-19,000001,Vente,40000,4,,RUE TOURNANTE,1970,42700,42095,Firminy,42,,,42095000AS0072,,,9,26.12,,,,,,,,,1,2,Appartement,45,2,,,,,,4.278714,45.385467
2020-606109,2020-11-09,000001,Vente,56487,35,,BD ERNEST RENAN,0700,42700,42095,Firminy,42,,,42095000AR0245,,,37,,47,76.16,,,,,,,2,2,Appartement,75,4,,,,,,4.287456,45.385917
2020-606109,2020-11-09,000001,Vente,56487,35,,BD ERNEST RENAN,0700,42700,42095,Firminy,42,,,42095000AR0245,,,29,,,,,,,,,,1,3,Dépendance,,0,,,,,,4.287456,45.385917
2020-606230,2020-10-28,000001,Vente,23000,9,,RUE MARTIN BERNARD,1290,42700,42095,Firminy,42,,,42095000AR0353,,,10,,11,,2,,3,,9,,5,2,Appartement,80,4,,,,,,4.285285,45.38703
2020-606265,2020-11-13,000001,Vente,103000,9001,,RUE DE CORDE,0520,42700,42095,Firminy,42,,,42095000AE0825,,,239,,,,,,,,,,1,3,Dépendance,,0,,,,,,4.291277,45.393514
2020-606265,2020-11-13,000001,Vente,103000,4,,RUE DE L ABATTOIR,0020,42700,42095,Firminy,42,,,42095000AE0825,,,123,94.98,95,,,,,,,,2,2,Appartement,95,5,,,,,,4.291277,45.393514
2020-606272,2020-10-27,000001,Vente,135400,,,CHE DE LA DANSE,0590,42700,42095,Firminy,42,,,42095000BE0062,,,,,,,,,,,,,0,,,,,S,sols,,,89,4.276208,45.369049
2020-606272,2020-10-27,000001,Vente,135400,11,,CHE DE LA DANSE,0590,42700,42095,Firminy,42,,,42095000BH0054,,,,,,,,,,,,,0,1,Maison,65,3,S,sols,,,95,4.276253,45.369198
2020-606324,2020-11-17,000001,Vente,178000,6,,IMP DU BIEF,0230,42700,42095,Firminy,42,,,42095000AH0328,,,,,,,,,,,,,0,1,Maison,144,5,S,sols,,,451,4.295388,45.388274
2020-606346,2020-11-04,000002,Vente,40000,17,,RUE DE CORDE,0520,42700,42095,Firminy,42,,,42095000AW0163,,,,,,,,,,,,,0,,,,,AG,terrains d'agrément,,,10,4.289462,45.394675
2020-606346,2020-11-04,000002,Vente,40000,17,,RUE DE CORDE,0520,42700,42095,Firminy,42,,,42095000AW0164,,,,,,,,,,,,,0,,,,,AG,terrains d'agrément,,,189,4.289815,45.3947
2020-606346,2020-11-04,000002,Vente,40000,40,,RUE DE LA TOUR DE VARAN,1960,42700,42095,Firminy,42,,,42095000AW0246,,,,,,,,,,,,,0,,,,,S,sols,,,4321,4.289764,45.395029
2020-606513,2020-11-24,000001,Vente,250000,12,,CHE DES GRILLONS,0912,42700,42095,Firminy,42,,,42095000AO0332,,,,,,,,,,,,,0,1,Maison,100,4,S,sols,,,1010,4.289663,45.377097
2020-606516,2020-11-20,000001,Vente,57000,7,,RUE FERDINAND BUISSON,0760,42700,42095,Firminy,42,,,42095000AR0646,,,122,46.62,131,,,,,,,,2,2,Appartement,47,2,,,,,,4.290031,45.38628
2020-606571,2020-11-20,000001,Vente,30000,2,A,BD SAINT-CHARLES,1770,42700,42095,Firminy,42,,,42095000AT0495,,,15,,2,,,,,,,,2,2,Appartement,50,2,,,,,,4.284086,45.385279
2020-606571,2020-11-20,000001,Vente,30000,2,A,BD SAINT-CHARLES,1770,42700,42095,Firminy,42,,,42095000AT0495,,,16,,,,,,,,,,1,3,Dépendance,,0,,,,,,4.284086,45.385279
2020-606574,2020-11-13,000001,Vente,145000,52,,RUE DORIAN,0620,42700,42095,Firminy,42,,,42095000AV0009,,,,,,,,,,,,,0,1,Maison,188,5,S,sols,,,306,4.274124,45.391432
2020-606588,2020-11-19,000001,Vente,72000,2,,RUE COURBON BRIOUDE,0560,42700,42095,Firminy,42,,,42095000AH0251,,,14,73.05,2,,,,,,,,2,2,Appartement,71,4,,,,,,4.2912,45.390298
2020-606588,2020-11-19,000001,Vente,72000,2,,RUE COURBON BRIOUDE,0560,42700,42095,Firminy,42,,,42095000AH0251,,,9,,,,,,,,,,1,3,Dépendance,,0,,,,,,4.2912,45.390298
2020-606613,2020-11-25,000001,Vente,217000,16,,ALL DE LA CHAZELIERE,0443,42700,42095,Firminy,42,,,42095000BB0130,,,,,,,,,,,,,0,1,Maison,94,4,S,sols,,,357,4.279322,45.371085
2020-606639,2020-11-17,000001,Vente,1,9001,,CHE DU GUE,0920,42700,42095,Firminy,42,,,42095000AS0317,,,,,,,,,,,,,0,4,Local industriel. commercial ou assimilé,740,0,S,sols,,,6180,4.275328,45.381825
2020-606836,2020-11-30,000001,Vente,89000,5,,RUE LOUIS BLANC,1190,42700,42095,Firminy,42,,,42095000AH0728,,,157,,42,82.43,,,,,,,2,2,Appartement,83,4,,,,,,4.288773,45.391065
2020-606836,2020-11-30,000001,Vente,89000,5,,RUE LOUIS BLANC,1190,42700,42095,Firminy,42,,,42095000AH0728,,,68,15,,,,,,,,,1,3,Dépendance,,0,,,,,,4.288773,45.391065
2020-606850,2020-11-27,000001,Vente,39000,1,,RUE MARCELLIN BERTHELOT,1220,42700,42095,Firminy,42,,,42095000AH0495,,,16,,8,94.58,,,,,,,2,2,Appartement,100,4,,,,,,4.292163,45.390695
2020-606853,2020-11-24,000001,Vente,233000,3,,ALL ANTONIN BARBIER,0064,42700,42095,Firminy,42,,,42095000AX0270,,,,,,,,,,,,,0,1,Maison,94,4,S,sols,,,536,4.293696,45.378721
2020-606854,2020-11-25,000001,Vente,305000,5,B,CHE SAINTE POULETTE,1790,42700,42095,Firminy,42,,,42095000BE0103,,,,,,,,,,,,,0,1,Maison,95,4,S,sols,,,773,4.278633,45.368306
2020-606854,2020-11-25,000001,Vente,305000,,,LE PIOCHON,B077,42700,42095,Firminy,42,,,42095000BE0108,,,,,,,,,,,,,0,,,,,S,sols,,,451,4.278167,45.368022
2020-606957,2020-12-03,000001,Vente,140000,6,B,RUE DE L ETERNITE,0710,42700,42095,Firminy,42,,,42095000AR0535,,,,,,,,,,,,,0,1,Maison,92,4,S,sols,,,628,4.29072,45.386031
2020-607084,2020-11-20,000001,Vente,170000,26,,RUE DE L ABBAYE,0030,42700,42095,Firminy,42,,,42095000BH0097,,,,,,,,,,,,,0,1,Maison,74,4,AG,terrains d'agrément,,,346,4.27715,45.369907
2020-607084,2020-11-20,000001,Vente,170000,26,,RUE DE L ABBAYE,0030,42700,42095,Firminy,42,,,42095000BH0097,,,,,,,,,,,,,0,1,Maison,74,4,J,jardins,POTAG,Jardin potager,203,4.27715,45.369907
2020-607084,2020-11-20,000001,Vente,170000,26,,RUE DE L ABBAYE,0030,42700,42095,Firminy,42,,,42095000BH0097,,,,,,,,,,,,,0,1,Maison,74,4,S,sols,,,267,4.27715,45.369907
2020-607129,2020-12-03,000001,Vente,220000,12,,CHE DU PAROUEYS,1426,42700,42095,Firminy,42,,,42095000BC0059,,,,,,,,,,,,,0,1,Maison,88,5,S,sols,,,554,4.281135,45.366771
2020-607129,2020-12-03,000001,Vente,220000,12,,CHE DU PAROUEYS,1426,42700,42095,Firminy,42,,,42095000BC0059,,,,,,,,,,,,,0,1,Maison,88,5,AG,terrains d'agrément,,,544,4.281135,45.366771
2020-607129,2020-12-03,000001,Vente,220000,12,,CHE DU PAROUEYS,1426,42700,42095,Firminy,42,,,42095000BC0060,,,,,,,,,,,,,0,,,,,T,terres,,,28,4.281124,45.366649
2020-607129,2020-12-03,000001,Vente,220000,,,CHE DU PAROUEYS,1426,42700,42095,Firminy,42,,,42095000BC0069,,,,,,,,,,,,,0,,,,,AG,terrains d'agrément,IMM,Dépendances d'ensemble immobilier,792,4.28068,45.366559
2020-607129,2020-12-03,000001,Vente,220000,,,CHE DU PAROUEYS,1426,42700,42095,Firminy,42,,,42095000BC0070,,,,,,,,,,,,,0,,,,,S,sols,,,2383,4.28023,45.36656
2020-607129,2020-12-03,000001,Vente,220000,12,B,CHE DU PAROUEYS,1426,42700,42095,Firminy,42,,,42095000BC0078,,,,,,,,,,,,,0,,,,,AG,terrains d'agrément,IMM,Dépendances d'ensemble immobilier,143,4.280961,45.366546
2020-607129,2020-12-03,000001,Vente,220000,,,CHE DE BRUCHERE,0270,42700,42095,Firminy,42,,,42095000BC0139,,,,,,,,,,,,,0,,,,,S,sols,,,19,4.279192,45.366722
2020-607129,2020-12-03,000001,Vente,220000,,,LE PIOCHON,B077,42700,42095,Firminy,42,,,42095000BD0057,,,,,,,,,,,,,0,,,,,AG,terrains d'agrément,IMM,Dépendances d'ensemble immobilier,3365,4.278632,45.36483
2020-607129,2020-12-03,000001,Vente,220000,,,CHE DE MONTFERRET,1337,42700,42095,Firminy,42,,,42095000BD0064,,,,,,,,,,,,,0,,,,,S,sols,,,2377,4.278729,45.365301
2020-607129,2020-12-03,000001,Vente,220000,,,CHE DE BRUCHERE,0270,42700,42095,Firminy,42,,,42095000BD0075,,,,,,,,,,,,,0,,,,,S,sols,,,16,4.279113,45.36663
2020-607129,2020-12-03,000001,Vente,220000,,,CHE DU RUISSEAU,1745,42700,42095,Firminy,42,,,42095000BD0101,,,,,,,,,,,,,0,,,,,S,sols,,,140,4.278506,45.367062
2020-607129,2020-12-03,000001,Vente,220000,8,,CHE DU RUISSEAU,1745,42700,42095,Firminy,42,,,42095000BD0165,,,,,,,,,,,,,0,,,,,S,sols,,,24,4.277913,45.365783
2020-607201,2020-12-08,000001,Vente,90000,22,,IMP BERTHAIL PRENAT,0220,42700,42095,Firminy,42,,,42095000AD0015,,,,,,,,,,,,,0,1,Maison,78,3,S,sols,,,198,4.288951,45.395951
2020-607230,2020-12-09,000001,Vente,49000,16,,CHE DU BEAL,0200,42700,42095,Firminy,42,,,42095000AI0186,,,23,,41,63.41,,,,,,,2,2,Appartement,60,2,,,,,,4.297139,45.38602
2020-607230,2020-12-09,000001,Vente,49000,16,,CHE DU BEAL,0200,42700,42095,Firminy,42,,,42095000AI0186,,,10,,,,,,,,,,1,3,Dépendance,,0,,,,,,4.297139,45.38602
2020-607279,2020-12-01,000001,Vente,550000,,,LES TROIS PONTS,B103,42700,42095,Firminy,42,,,42095000AC0068,,,,,,,,,,,,,0,,,,,S,sols,,,3948,4.29857,45.398184
2020-607279,2020-12-01,000001,Vente,550000,58,,RUE PROFESSEUR CALMETTE,1640,42700,42095,Firminy,42,,,42095000AC0069,,,,,,,,,,,,,0,4,Local industriel. commercial ou assimilé,1676,0,S,sols,,,8210,4.298065,45.398461
2020-607328,2020-12-11,000001,Vente,54500,107,,RUE JEAN JAURES,1030,42700,42095,Firminy,42,,,42095000AT0259,,,6,63.23,,,,,,,,,1,2,Appartement,63,3,,,,,,4.284989,45.387594
2020-607567,2020-12-17,000001,Vente,91350,10,,RUE LOUIS BLANC,1190,42700,42095,Firminy,42,,,42095000AH0450,,,260,75.73,88,,,,,,,,2,2,Appartement,85,3,,,,,,4.287845,45.391143
2020-607567,2020-12-17,000001,Vente,91350,10,,RUE LOUIS BLANC,1190,42700,42095,Firminy,42,,,42095000AH0450,,,240,,,,,,,,,,1,3,Dépendance,,0,,,,,,4.287845,45.391143
2020-607568,2020-12-14,000001,Vente,105000,9005,,CHE DU GUE,0920,42700,42095,Firminy,42,,,42095000AS0324,,,18,101.61,,,,,,,,,1,1,Maison,113,5,,,,,,4.277345,45.383232
2020-607576,2020-12-18,000001,Vente,49000,8,,BD FAYOL,0720,42700,42095,Firminy,42,,,42095000AE0975,,,304,,37,,,,,,,,2,2,Appartement,52,2,,,,,,4.290976,45.391564
2020-607576,2020-12-18,000001,Vente,49000,8,,BD FAYOL,0720,42700,42095,Firminy,42,,,42095000AE0975,,,113,,,,,,,,,,1,3,Dépendance,,0,,,,,,4.290976,45.391564
2020-607675,2020-12-02,000001,Vente,10000,3,,RUE PASTEUR,1440,42700,42095,Firminy,42,,,42095000AT0870,,,28,,,,,,,,,,1,3,Dépendance,,0,,,,,,4.283877,45.38863
2020-607732,2020-12-15,000001,Vente,150000,6,,RUE DES SAGNES,1760,42700,42095,Firminy,42,,,42095000AP0044,,,,,,,,,,,,,0,,,,,J,jardins,POTAG,Jardin potager,259,4.285934,45.381066
2020-607732,2020-12-15,000001,Vente,150000,4,,RUE DES SAGNES,1760,42700,42095,Firminy,42,,,42095000AP0045,,,,,,,,,,,,,0,1,Maison,93,5,S,sols,,,400,4.285937,45.381213
2020-607732,2020-12-15,000001,Vente,150000,2,,RUE DES SAGNES,1760,42700,42095,Firminy,42,,,42095000AP0161,,,,,,,,,,,,,0,,,,,S,sols,,,188,4.286042,45.381228
2020-607785,2020-12-17,000001,Vente,,,,RUE DES PERRIERES,1493,42700,42095,Firminy,42,,,42095000AI0387,,,,,,,,,,,,,0,,,,,S,sols,,,77,4.299559,45.383805
2020-607796,2020-12-04,000001,Vente,95000,20,,RUE DE LA PLATINIERE,1550,42700,42095,Firminy,42,,,42095000AE0266,,,,,,,,,,,,,0,2,Appartement,32,2,S,sols,,,283,4.296313,45.392781
2020-607796,2020-12-04,000001,Vente,95000,20,,RUE DE LA PLATINIERE,1550,42700,42095,Firminy,42,,,42095000AE0266,,,,,,,,,,,,,0,2,Appartement,62,2,S,sols,,,283,4.296313,45.392781
2020-607796,2020-12-04,000001,Vente,95000,20,,RUE DE LA PLATINIERE,1550,42700,42095,Firminy,42,,,42095000AE0266,,,,,,,,,,,,,0,3,Dépendance,,0,S,sols,,,283,4.296313,45.392781
2020-607814,2020-12-16,000001,Vente,50000,6,,RUE PROFESSEUR CALMETTE,1640,42700,42095,Firminy,42,,,42095000AE0599,,,818,64.93,820,,,,,,,,2,2,Appartement,66,3,,,,,,4.292212,45.393976
2020-607814,2020-12-16,000001,Vente,50000,4,,RUE PROFESSEUR CALMETTE,1640,42700,42095,Firminy,42,,,42095000AE0599,,,187,,,,,,,,,,1,3,Dépendance,,0,,,,,,4.292212,45.393976
2020-607814,2020-12-16,000001,Vente,50000,4,,RUE PROFESSEUR CALMETTE,1640,42700,42095,Firminy,42,,,42095000AE0599,,,120,,,,,,,,,,1,3,Dépendance,,0,,,,,,4.292212,45.393976
2020-607955,2020-12-29,000001,Vente,56000,18,,BD SAINT-CHARLES,1770,42700,42095,Firminy,42,,,42095000AT0867,,,110,73.66,91,,,,,,,,2,2,Appartement,77,4,,,,,,4.283166,45.386324
2020-608001,2020-12-30,000001,Vente,54000,1,,RUE DE L ETERNITE,0710,42700,42095,Firminy,42,,,42095000AR0646,,,230,,,,,,,,,,1,3,Dépendance,,0,,,,,,4.290031,45.38628
2020-608001,2020-12-30,000001,Vente,54000,3,,RUE DE L ETERNITE,0710,42700,42095,Firminy,42,,,42095000AR0646,,,15,61.72,16,,,,,,,,2,2,Appartement,62,3,,,,,,4.290031,45.38628
2020-608077,2020-12-21,000001,Vente,45000,,,LAYAT,B058,42700,42095,Firminy,42,,,42095000AB0280,,,,,,,,,,,,,0,,,,,L,landes,,,2242,4.287093,45.397274
2020-608139,2020-12-22,000001,Vente,462000,28,,RUE DORIAN,0620,42700,42095,Firminy,42,,,42095000AV0300,,,,,,,,,,,,,0,,,,,S,sols,,,1147,4.276885,45.390399
2020-608139,2020-12-22,000001,Vente,462000,28,,RUE DORIAN,0620,42700,42095,Firminy,42,,,42095000AV0301,,,,,,,,,,,,,0,,,,,S,sols,,,1269,4.277225,45.390383
2020-608139,2020-12-22,000001,Vente,462000,24,,RUE DORIAN,0620,42700,42095,Firminy,42,,,42095000AV0302,,,,,,,,,,,,,0,,,,,AB,terrains a bâtir,,,680,4.277366,45.390318
2020-608139,2020-12-22,000001,Vente,462000,24,,RUE DORIAN,0620,42700,42095,Firminy,42,,,42095000AV0303,,,,,,,,,,,,,0,,,,,AB,terrains a bâtir,,,1806,4.277716,45.390356
2020-608139,2020-12-22,000001,Vente,462000,24,,RUE DORIAN,0620,42700,42095,Firminy,42,,,42095000AV0304,,,,,,,,,,,,,0,,,,,AB,terrains a bâtir,,,257,4.277947,45.39027
2020-608139,2020-12-22,000001,Vente,462000,24,,RUE DORIAN,0620,42700,42095,Firminy,42,,,42095000AV0305,,,,,,,,,,,,,0,,,,,AB,terrains a bâtir,,,472,4.278195,45.390263
2020-608156,2020-12-23,000001,Vente,75000,10,,RUE MICHELET,1320,42700,42095,Firminy,42,,,42095000AH0415,,,,,,,,,,,,,0,1,Maison,80,3,S,sols,,,524,4.29107,45.388391
2020-608193,2020-12-18,000001,Vente,33000,4,,AV DE LA GARE,0880,42700,42095,Firminy,42,,,42095000AT0486,,,119,36.46,,,,,,,,,1,4,Local industriel. commercial ou assimilé,35,0,,,,,,4.286882,45.389338
2020-608215,2020-12-23,000001,Vente,41500,15,,RUE DE LA PAIX,1420,42700,42095,Firminy,42,,,42095000AR0731,,,12,,28,52.55,,,,,,,2,2,Appartement,37,1,,,,,,4.286374,45.387875
2020-608237,2020-12-29,000001,Vente,27000,27,,RUE VICTOR HUGO,2080,42700,42095,Firminy,42,,,42095000AT0867,,,134,,159,48.53,,,,,,,2,2,Appartement,48,2,,,,,,4.283166,45.386324
2020-608253,2020-12-18,000001,Vente,112000,6,,RUE DE LA LOIRE,1170,42700,42095,Firminy,42,,,42095000AT0285,,,,,,,,,,,,,0,4,Local industriel. commercial ou assimilé,247,0,S,sols,,,288,4.284074,45.38725
2020-608253,2020-12-18,000001,Vente,112000,6,,RUE DE LA LOIRE,1170,42700,42095,Firminy,42,,,42095000AT0921,,,,,,,,,,,,,0,3,Dépendance,,0,S,sols,,,199,4.284022,45.387343
2020-608253,2020-12-18,000001,Vente,112000,6,,RUE DE LA LOIRE,1170,42700,42095,Firminy,42,,,42095000AT0921,,,,,,,,,,,,,0,3,Dépendance,,0,S,sols,,,199,4.284022,45.387343
2020-608253,2020-12-18,000001,Vente,112000,6,,RUE DE LA LOIRE,1170,42700,42095,Firminy,42,,,42095000AT0921,,,,,,,,,,,,,0,3,Dépendance,,0,S,sols,,,199,4.284022,45.387343
2020-608253,2020-12-18,000001,Vente,112000,6,,RUE DE LA LOIRE,1170,42700,42095,Firminy,42,,,42095000AT0921,,,,,,,,,,,,,0,2,Appartement,61,4,S,sols,,,199,4.284022,45.387343
2020-608256,2020-12-22,000001,Vente,300000,32,,CHE DES NOYERS,1372,42700,42095,Firminy,42,,,42095000AO0214,,,,,,,,,,,,,0,1,Maison,180,8,P,prés,,,2200,4.287335,45.376512
2020-608256,2020-12-22,000001,Vente,300000,32,,CHE DES NOYERS,1372,42700,42095,Firminy,42,,,42095000AO0214,,,,,,,,,,,,,0,1,Maison,180,8,S,sols,,,674,4.287335,45.376512
2020-608503,2020-12-23,000001,Vente en l'état futur d'achèvement,1560000,10,,RUE DU PONT NOIR,1590,42700,42095,Firminy,42,,,42095000AV0300,,,,,,,,,,,,,0,,,,,S,sols,,,1147,4.276885,45.390399
2020-608524,2020-12-29,000001,Vente,100000,9,,RUE PROFESSEUR CALMETTE,1640,42700,42095,Firminy,42,,,42095000AE0136,,,3,,,,,,,,,,1,3,Dépendance,,0,,,,,,4.292331,45.393229
2020-608524,2020-12-29,000001,Vente,100000,9,,RUE PROFESSEUR CALMETTE,1640,42700,42095,Firminy,42,,,42095000AE0136,,,6,80.4,,,,,,,,,1,2,Appartement,75,3,,,,,,4.292331,45.393229
2020-608527,2020-12-23,000001,Vente,97000,15,,PL DU MARCHE,1240,42700,42095,Firminy,42,,,42095000AR0652,,,31,,,,,,,,,,1,3,Dépendance,,0,,,,,,4.285372,45.38638
2020-608527,2020-12-23,000001,Vente,97000,1,,RUE TREMOLLET,2010,42700,42095,Firminy,42,,,42095000AR0652,,,1,,52,96.07,,,,,,,2,2,Appartement,96,4,,,,,,4.285372,45.38638
2020-608545,2020-12-29,000002,Vente en l'état futur d'achèvement,540000,,,LE GARAY POINTU,B046,42700,42095,Firminy,42,,,42095000BH0145,,,,,,,,,,,,,0,,,,,AB,terrains a bâtir,,,1148,4.271999,45.371425
2020-608545,2020-12-29,000002,Vente en l'état futur d'achèvement,540000,,,LE GARAY POINTU,B046,42700,42095,Firminy,42,,,42095000BH0147,,,,,,,,,,,,,0,,,,,AB,terrains a bâtir,,,231,4.271803,45.371361
2020-608545,2020-12-29,000002,Vente en l'état futur d'achèvement,540000,,,LE GARAY POINTU,B046,42700,42095,Firminy,42,,,42095000BH0148,,,,,,,,,,,,,0,,,,,AB,terrains a bâtir,,,275,4.271759,45.37133
2020-608545,2020-12-29,000002,Vente en l'état futur d'achèvement,540000,,,LE GARAY POINTU,B046,42700,42095,Firminy,42,,,42095000BH0149,,,,,,,,,,,,,0,,,,,AB,terrains a bâtir,,,1050,4.271722,45.371254
2020-608715,2020-01-08,000001,Vente,185000,12,,RUE PERRIN AUBERT,1500,42700,42095,Firminy,42,,,42095000AW0085,,,,,,,,,,,,,0,1,Maison,73,3,S,sols,,,522,4.290195,45.39346
2020-608735,2020-01-09,000001,Vente,85000,8,,BD FAYOL,0720,42700,42095,Firminy,42,,,42095000AE0975,,,212,,41,78.72,,,,,,,2,2,Appartement,78,4,,,,,,4.290976,45.391564
2020-608735,2020-01-09,000001,Vente,85000,8,,BD FAYOL,0720,42700,42095,Firminy,42,,,42095000AE0975,,,157,,,,,,,,,,1,3,Dépendance,,0,,,,,,4.290976,45.391564
2020-608740,2020-01-10,000001,Vente,34000,10,,RUE CENTRALE,0350,42700,42095,Firminy,42,,,42095000AR0431,,,13,45.93,5,,,,,,,,2,2,Appartement,54,3,,,,,,4.286286,45.386424
2020-608753,2020-01-14,000001,Vente,45000,10,,RUE LIMOUZIN,1160,42700,42095,Firminy,42,,,42095000AH0153,,,14,,3,57.3,,,,,,,2,2,Appartement,60,2,,,,,,4.288944,45.388879
2020-608782,2020-01-07,000001,Vente,159000,6,,CHE DU BARRAGE,0130,42700,42095,Firminy,42,,,42095000AK0281,,,1,89.07,3,,,,,,,,2,2,Appartement,75,4,,,,,,4.303506,45.377084
2020-608782,2020-01-07,000001,Vente,159000,,,BAS DE LA COTE,B004,42700,42095,Firminy,42,,,42095000AK0292,,,,,,,,,,,,,0,,,,,S,sols,,,5,4.303388,45.376985
2020-608782,2020-01-07,000001,Vente,159000,,,BAS DE LA COTE,B004,42700,42095,Firminy,42,,,42095000AK0411,,,,,,,,,,,,,0,,,,,J,jardins,POTAG,Jardin potager,75,4.303353,45.3771
2020-608782,2020-01-07,000001,Vente,159000,6,,CHE DU BARRAGE,0130,42700,42095,Firminy,42,,,42095000AK0413,,,,,,,,,,,,,0,3,Dépendance,,0,S,sols,,,296,4.303281,45.377045
2020-608810,2020-01-20,000001,Vente,50000,38,,RUE SADI CARNOT,1750,42700,42095,Firminy,42,,,42095000AR0685,,,,,,,,,,,,,0,4,Local industriel. commercial ou assimilé,166,0,S,sols,,,201,4.287849,45.384708
2020-608822,2020-01-17,000001,Vente,64400,19,,RUE JEAN JAURES,1030,42700,42095,Firminy,42,,,42095000AH0728,,,12,85,125,,,,,,,,2,2,Appartement,83,4,,,,,,4.288773,45.391065
2020-608822,2020-01-17,000001,Vente,64400,5,,RUE LOUIS BLANC,1190,42700,42095,Firminy,42,,,42095000AH0728,,,79,,,,,,,,,,1,3,Dépendance,,0,,,,,,4.288773,45.391065
2020-608898,2020-01-30,000001,Vente,33000,20,,BD SAINT CHARLES,1770,42700,42095,Firminy,42,,,42095000AT0462,,,269,,,,,,,,,,1,3,Dépendance,,0,,,,,,4.282539,45.386909
2020-608898,2020-01-30,000001,Vente,33000,26,,BD SAINT CHARLES,1770,42700,42095,Firminy,42,,,42095000AT0462,,,146,,65,,,,,,,,2,2,Appartement,71,4,,,,,,4.282539,45.386909
2020-608936,2020-01-28,000001,Vente,135000,33,B,RUE TREMOLLET,2010,42700,42095,Firminy,42,,,42095000AT0924,,,4,81.51,47,,,,,,,,2,2,Appartement,82,3,,,,,,4.281691,45.384005
2020-608936,2020-01-28,000001,Vente,135000,33,B,RUE TREMOLLET,2010,42700,42095,Firminy,42,,,42095000AT0924,,,192,,,,,,,,,,1,3,Dépendance,,0,,,,,,4.281691,45.384005
2020-608936,2020-01-28,000001,Vente,135000,33,B,RUE TREMOLLET,2010,42700,42095,Firminy,42,,,42095000AT0924,,,77,,,,,,,,,,1,3,Dépendance,,0,,,,,,4.281691,45.384005