id_mutation,date_mutation,numero_disposition,nature_mutation,valeur_fonciere,adresse_numero,adresse_suffixe,adresse_nom_voie,adresse_code_voie,code_postal,code_commune,nom_commune,code_departement,ancien_code_commune,ancien_nom_commune,id_parcelle,ancien_id_parcelle,numero_volume,lot1_numero,lot1_surface_carrez,lot2_numero,lot2_surface_carrez,lot3_numero,lot3_surface_carrez,lot4_numero,lot4_surface_carrez,lot5_numero,lot5_surface_carrez,nombre_lots,code_type_local,type_local,surface_reelle_bati,nombre_pieces_principales,code_nature_culture,nature_culture,code_nature_culture_speciale,nature_culture_speciale,surface_terrain,longitude,latitude
2020-678811,2020-01-10,000001,Vente,4700,,,PIECES LONGUES CHAMPS MONP,B283,46340,46087,Dégagnac,46,,,460870000D0634,,,,,,,,,,,,,0,,,,,T,terres,,,6570,1.335336,44.649183
2020-678811,2020-01-10,000001,Vente,4700,,,PIECES LONGUES CHAMPS MONP,B283,46340,46087,Dégagnac,46,,,460870000D0635,,,,,,,,,,,,,0,,,,,P,prés,,,6890,1.336128,44.649312
2020-679221,2020-02-05,000001,Vente,600,,,CHAMP DE LANTIS,B061,46340,46087,Dégagnac,46,,,460870000G0721,,,,,,,,,,,,,0,,,,,P,prés,,,2000,1.314742,44.670809
2020-679337,2020-02-15,000001,Vente,3000,,,LA MASUQUE,B221,46340,46087,Dégagnac,46,,,460870000F0490,,,,,,,,,,,,,0,,,,,BF,futaies feuillues,,,2300,1.308735,44.655033
2020-679337,2020-02-15,000001,Vente,3000,,,LES ISSARDS,B172,46340,46087,Dégagnac,46,,,460870000G0266,,,,,,,,,,,,,0,,,,,L,landes,,,790,1.326405,44.681314
2020-679337,2020-02-15,000001,Vente,3000,,,LES ISSARDS,B172,46340,46087,Dégagnac,46,,,460870000G0270,,,,,,,,,,,,,0,,,,,BT,taillis simples,,,315,1.325892,44.682241
2020-679337,2020-02-15,000001,Vente,3000,,,LES ISSARDS,B172,46340,46087,Dégagnac,46,,,460870000G0271,,,,,,,,,,,,,0,,,,,T,terres,,,1075,1.326208,44.681748
2020-679337,2020-02-15,000001,Vente,3000,,,LES ISSARDS,B172,46340,46087,Dégagnac,46,,,460870000G0273,,,,,,,,,,,,,0,,,,,T,terres,,,2800,1.326495,44.681966
2020-679337,2020-02-15,000001,Vente,3000,,,LES ISSARDS,B172,46340,46087,Dégagnac,46,,,460870000G0277,,,,,,,,,,,,,0,,,,,L,landes,,,1630,1.327053,44.682312
2020-679337,2020-02-15,000001,Vente,3000,,,LES ISSARDS,B172,46340,46087,Dégagnac,46,,,460870000G0284,,,,,,,,,,,,,0,,,,,BT,taillis simples,,,1720,1.326461,44.682699
2020-679337,2020-02-15,000001,Vente,3000,,,LES ISSARDS,B172,46340,46087,Dégagnac,46,,,460870000G0317,,,,,,,,,,,,,0,,,,,BT,taillis simples,,,524,1.329224,44.685242
2020-679337,2020-02-15,000001,Vente,3000,,,LES ISSARDS,B172,46340,46087,Dégagnac,46,,,460870000G0325,,,,,,,,,,,,,0,,,,,BT,taillis simples,,,1575,1.329527,44.686153
2020-679337,2020-02-15,000001,Vente,3000,,,CHATEAU DE LANTIS,B074,46340,46087,Dégagnac,46,,,460870000G0804,,,,,,,,,,,,,0,,,,,T,terres,,,590,1.318377,44.675264
2020-679337,2020-02-15,000001,Vente,3000,,,CHATEAU DE LANTIS,B074,46340,46087,Dégagnac,46,,,460870000G0805,,,,,,,,,,,,,0,,,,,T,terres,,,1070,1.318204,44.674951
2020-679337,2020-02-15,000001,Vente,3000,,,CHATEAU DE LANTIS,B074,46340,46087,Dégagnac,46,,,460870000G0833,,,,,,,,,,,,,0,,,,,T,terres,,,3923,1.319736,44.676614
2020-679337,2020-02-15,000001,Vente,3000,,,CHATEAU DE LANTIS,B074,46340,46087,Dégagnac,46,,,460870000G0833,,,,,,,,,,,,,0,,,,,T,terres,,,3922,1.319736,44.676614
2020-679337,2020-02-15,000001,Vente,3000,,,LABORIE,B183,46340,46087,Dégagnac,46,,,460870000H0615,,,,,,,,,,,,,0,,,,,S,sols,,,20,1.319945,44.672346
2020-679337,2020-02-15,000001,Vente,3000,,,LABORIE,B183,46340,46087,Dégagnac,46,,,460870000H0616,,,,,,,,,,,,,0,,,,,T,terres,,,4770,1.319384,44.672292
2020-679593,2020-02-24,000001,Vente,262182,5938,F,DEGAGNAC,B134,46340,46087,Dégagnac,46,,,460870000H0938,,,,,,,,,,,,,0,3,Dépendance,,0,S,sols,,,35,1.3146,44.664231
2020-679593,2020-02-24,000001,Vente,262182,,,DEGAGNAC,B134,46340,46087,Dégagnac,46,,,460870000H1583,,,,,,,,,,,,,0,,,,,L,landes,,,3,1.314568,44.66422
2020-679593,2020-02-24,000001,Vente,262182,5507,F,DEGAGNAC,B134,46340,46087,Dégagnac,46,,,460870000H1584,,,,,,,,,,,,,0,1,Maison,120,5,S,sols,,,733,1.31474,44.664277
2020-679790,2020-03-20,000003,Vente,180520,,,BAROU,B007,46340,46087,Dégagnac,46,,,460870000C1428,,,,,,,,,,,,,0,,,,,S,sols,,,21,1.350271,44.658446
2020-679790,2020-03-20,000003,Vente,180520,,,BAROU,B007,46340,46087,Dégagnac,46,,,460870000C1709,,,,,,,,,,,,,0,,,,,J,jardins,POTAG,Jardin potager,20,1.350108,44.658581
2020-679935,2020-04-22,000001,Vente,5000,,,BAROU,B007,46340,46087,Dégagnac,46,,,460870000C1695,,,,,,,,,,,,,0,,,,,S,sols,,,160,1.350005,44.658391
2020-679935,2020-04-22,000001,Vente,5000,,,BAROU,B007,46340,46087,Dégagnac,46,,,460870000C1695,,,,,,,,,,,,,0,,,,,T,terres,,,678,1.350005,44.658391
2020-679935,2020-04-22,000001,Vente,5000,,,BAROU,B007,46340,46087,Dégagnac,46,,,460870000C1710,,,,,,,,,,,,,0,,,,,J,jardins,POTAG,Jardin potager,460,1.350165,44.658349
2020-679971,2020-04-29,000001,Vente,4000,,,CHAMP DE PAROU,B064,46340,46087,Dégagnac,46,,,460870000E0104,,,,,,,,,,,,,0,,,,,T,terres,,,780,1.286349,44.656693
2020-679971,2020-04-29,000001,Vente,4000,,,CHAMP DE PAROU,B064,46340,46087,Dégagnac,46,,,460870000E0105,,,,,,,,,,,,,0,,,,,T,terres,,,10957,1.285252,44.657372
2020-679971,2020-04-29,000001,Vente,4000,,,CHAMP DE PAROU,B064,46340,46087,Dégagnac,46,,,460870000E0105,,,,,,,,,,,,,0,,,,,T,terres,,,5478,1.285252,44.657372
2020-679971,2020-04-29,000001,Vente,4000,,,LE MAS,B203,46340,46087,Dégagnac,46,,,460870000F0967,,,,,,,,,,,,,0,,,,,T,terres,,,2220,1.285044,44.661027
2020-680481,2020-05-26,000001,Vente,28000,,,LATAPIE,B190,46340,46087,Dégagnac,46,,,460870000D1792,,,,,,,,,,,,,0,,,,,J,jardins,POTAG,Jardin potager,480,1.337153,44.642563
2020-680481,2020-05-26,000001,Vente,28000,,,LATAPIE,B190,46340,46087,Dégagnac,46,,,460870000D1793,,,,,,,,,,,,,0,,,,,T,terres,,,1330,1.336998,44.642298
2020-680481,2020-05-26,000001,Vente,28000,,,LATAPIE,B190,46340,46087,Dégagnac,46,,,460870000D1794,,,,,,,,,,,,,0,,,,,T,terres,,,1765,1.33688,44.641995
2020-680706,2020-06-23,000001,Vente,1,,,LES BANNADES,B004,46340,46087,Dégagnac,46,,,460870000F1721,,,,,,,,,,,,,0,,,,,BF,futaies feuillues,,,86,1.293668,44.668121
2020-680706,2020-06-23,000001,Vente,1,,,LES BANNADES,B004,46340,46087,Dégagnac,46,,,460870000F1722,,,,,,,,,,,,,0,,,,,BF,futaies feuillues,,,93,1.293204,44.668325
2020-680712,2020-06-23,000002,Vente,1,,,LES BANNADES,B004,46340,46087,Dégagnac,46,,,460870000F1726,,,,,,,,,,,,,0,,,,,T,terres,,,9,1.293745,44.668062
2020-680712,2020-06-23,000002,Vente,1,,,LES BANNADES,B004,46340,46087,Dégagnac,46,,,460870000F1730,,,,,,,,,,,,,0,,,,,BT,taillis simples,,,53,1.293423,44.668249
2020-680712,2020-06-23,000002,Vente,1,,,LES BANNADES,B004,46340,46087,Dégagnac,46,,,460870000F1733,,,,,,,,,,,,,0,,,,,BT,taillis simples,,,61,1.29299,44.668326
2020-680799,2020-06-23,000001,Vente,1200,,,PIECES LONGUES CHAMPS MONP,B283,46340,46087,Dégagnac,46,,,460870000D0653,,,,,,,,,,,,,0,,,,,L,landes,,,1265,1.333853,44.650511
2020-680799,2020-06-23,000001,Vente,1200,,,PIECES LONGUES CHAMPS MONP,B283,46340,46087,Dégagnac,46,,,460870000D0654,,,,,,,,,,,,,0,,,,,BT,taillis simples,,,4395,1.335057,44.650554
2020-680799,2020-06-23,000001,Vente,1200,,,MONSALVY,B231,46340,46087,Dégagnac,46,,,460870000D0704,,,,,,,,,,,,,0,,,,,L,landes,,,1145,1.333345,44.650688
2020-680805,2020-06-25,000001,Vente,3500,,,LE CUSTALOU,B132,46340,46087,Dégagnac,46,,,460870000H0313,,,,,,,,,,,,,0,,,,,BF,futaies feuillues,,,1020,1.333662,44.668546
2020-680805,2020-06-25,000001,Vente,3500,,,LES CHAMPS,B066,46340,46087,Dégagnac,46,,,460870000H0356,,,,,,,,,,,,,0,,,,,T,terres,,,9667,1.334689,44.666603
2020-680805,2020-06-25,000001,Vente,3500,,,LES CHAMPS,B066,46340,46087,Dégagnac,46,,,460870000H0356,,,,,,,,,,,,,0,,,,,T,terres,,,4833,1.334689,44.666603
2020-680805,2020-06-25,000001,Vente,3500,,,LES CHAMPS,B066,46340,46087,Dégagnac,46,,,460870000H0357,,,,,,,,,,,,,0,,,,,S,sols,,,220,1.334819,44.666823
2020-680805,2020-06-25,000001,Vente,3500,,,LES CHAMPS,B066,46340,46087,Dégagnac,46,,,460870000H0372,,,,,,,,,,,,,0,,,,,T,terres,,,1060,1.33335,44.665613
2020-680805,2020-06-25,000001,Vente,3500,,,LES CHAMPS,B066,46340,46087,Dégagnac,46,,,460870000H0373,,,,,,,,,,,,,0,,,,,T,terres,,,680,1.333624,44.665384
2020-680805,2020-06-25,000001,Vente,3500,,,LES CHAMPS,B066,46340,46087,Dégagnac,46,,,460870000H0374,,,,,,,,,,,,,0,,,,,T,terres,,,2225,1.333139,44.665378
2020-680805,2020-06-25,000001,Vente,3500,,,LES CHAMPS,B066,46340,46087,Dégagnac,46,,,460870000H0375,,,,,,,,,,,,,0,,,,,BT,taillis simples,,,1540,1.333693,44.665052
2020-680805,2020-06-25,000001,Vente,3500,,,LES CHAMPS,B066,46340,46087,Dégagnac,46,,,460870000H0376,,,,,,,,,,,,,0,,,,,T,terres,,,640,1.333451,44.665079
2020-681037,2020-07-20,000001,Vente,1500,,,CHAMPS DE MERLE,B069,46340,46087,Dégagnac,46,,,460870000H0089,,,,,,,,,,,,,0,,,,,T,terres,,,500,1.330994,44.67343
2020-681078,2020-07-20,000001,Vente,80000,5077,,DEGAGNAC,B134,46340,46087,Dégagnac,46,,,460870000H0904,,,,,,,,,,,,,0,1,Maison,120,5,S,sols,,,85,1.316724,44.665311
2020-681078,2020-07-20,000001,Vente,80000,,,DEGAGNAC,B134,46340,46087,Dégagnac,46,,,460870000H0905,,,,,,,,,,,,,0,,,,,S,sols,,,330,1.316906,44.665265
2020-681112,2020-08-04,000001,Vente,110000,,,DEGAGNAC,B134,46340,46087,Dégagnac,46,,,460870000H0920,,,,,,,,,,,,,0,,,,,S,sols,,,90,1.316406,44.664623
2020-681112,2020-08-04,000001,Vente,110000,5112,,DEGAGNAC,B134,46340,46087,Dégagnac,46,,,460870000H0921,,,,,,,,,,,,,0,1,Maison,110,5,S,sols,,,310,1.316458,44.664535
2020-681325,2020-07-28,000001,Vente,4000,,,LA COMBE DE CHAUDE,B091,46340,46087,Dégagnac,46,,,460870000D1051,,,,,,,,,,,,,0,,,,,P,prés,,,1680,1.366871,44.646577
2020-681325,2020-07-28,000001,Vente,4000,,,RIVIERE DE RIVALES,B327,46340,46087,Dégagnac,46,,,460870000D1318,,,,,,,,,,,,,0,,,,,P,prés,,,2620,1.360044,44.65734
2020-681325,2020-07-28,000001,Vente,4000,,,RIVIERE DE RIVALES,B327,46340,46087,Dégagnac,46,,,460870000D1337,,,,,,,,,,,,,0,,,,,P,prés,,,30,1.367208,44.648368
2020-681598,2020-08-18,000001,Vente,1,,,LE MAZOU,B225,46340,46087,Dégagnac,46,,,460870000F1541,,,,,,,,,,,,,0,,,,,S,sols,,,79,1.29501,44.665581
2020-681598,2020-08-18,000001,Vente,1,,,LE MAZOU,B225,46340,46087,Dégagnac,46,,,460870000F1632,,,,,,,,,,,,,0,,,,,S,sols,,,33,1.294647,44.665399
2020-681616,2020-08-18,000001,Vente,20000,,,LE MAZOU,B225,46340,46087,Dégagnac,46,,,460870000F1447,,,,,,,,,,,,,0,,,,,S,sols,,,320,1.294606,44.665624
2020-681616,2020-08-18,000001,Vente,20000,,,LE MAZOU,B225,46340,46087,Dégagnac,46,,,460870000F1609,,,,,,,,,,,,,0,,,,,P,prés,,,250,1.294415,44.665511
2020-681616,2020-08-18,000001,Vente,20000,,,LE MAZOU,B225,46340,46087,Dégagnac,46,,,460870000F1620,,,,,,,,,,,,,0,,,,,S,sols,,,358,1.294674,44.665247
2020-681616,2020-08-18,000001,Vente,20000,,,LE MAZOU,B225,46340,46087,Dégagnac,46,,,460870000F1621,,,,,,,,,,,,,0,,,,,L,landes,,,8,1.294778,44.665099
2020-681616,2020-08-18,000001,Vente,20000,,,LE MAZOU,B225,46340,46087,Dégagnac,46,,,460870000F1623,,,,,,,,,,,,,0,,,,,T,terres,,,22,1.294683,44.66467
2020-681616,2020-08-18,000001,Vente,20000,,,LE MAZOU,B225,46340,46087,Dégagnac,46,,,460870000F1626,,,,,,,,,,,,,0,,,,,T,terres,,,111,1.294689,44.665107
2020-681616,2020-08-18,000001,Vente,20000,,,LE MAZOU,B225,46340,46087,Dégagnac,46,,,460870000F1630,,,,,,,,,,,,,0,,,,,T,terres,,,518,1.294727,44.664848
2020-681819,2020-09-05,000001,Vente,152750,,,POUDENS BAS,B382,46340,46087,Dégagnac,46,,,460870000B0721,,,,,,,,,,,,,0,,,,,T,terres,,,1535,1.357166,44.690754
2020-681819,2020-09-05,000001,Vente,152750,5193,,POUDENS BAS,B382,46340,46087,Dégagnac,46,,,460870000B1789,,,,,,,,,,,,,0,1,Maison,70,2,S,sols,,,400,1.357159,44.69041
2020-682257,2020-10-09,000001,Vente,179150,5470,F,LES GRANGES,B165,46340,46087,Dégagnac,46,,,460870000C1250,,,,,,,,,,,,,0,1,Maison,131,4,T,terres,,,1670,1.342365,44.664138
2020-682257,2020-10-09,000001,Vente,179150,5470,F,LES GRANGES,B165,46340,46087,Dégagnac,46,,,460870000C1250,,,,,,,,,,,,,0,1,Maison,131,4,S,sols,,,500,1.342365,44.664138
2020-682257,2020-10-09,000001,Vente,179150,,,LES GRANGES,B165,46340,46087,Dégagnac,46,,,460870000C1265,,,,,,,,,,,,,0,,,,,T,terres,,,2755,1.340583,44.663976
2020-682257,2020-10-09,000001,Vente,179150,,,LES GRANGES,B165,46340,46087,Dégagnac,46,,,460870000C1266,,,,,,,,,,,,,0,,,,,L,landes,,,3295,1.341449,44.664014
2020-682257,2020-10-09,000001,Vente,179150,,,LES GRANGES,B165,46340,46087,Dégagnac,46,,,460870000C1267,,,,,,,,,,,,,0,,,,,T,terres,,,2195,1.342,44.664124
2020-682383,2020-10-19,000002,Vente,100000,,,LES FOURCARIES,B151,46340,46087,Dégagnac,46,,,460870000E0526,,,,,,,,,,,,,0,,,,,L,landes,,,3290,1.292624,44.652027
2020-682383,2020-10-19,000002,Vente,100000,,,LES FOURCARIES,B151,46340,46087,Dégagnac,46,,,460870000E1125,,,,,,,,,,,,,0,,,,,S,sols,,,804,1.29167,44.652239
2020-682383,2020-10-19,000002,Vente,100000,,,LES FOURCARIES,B151,46340,46087,Dégagnac,46,,,460870000E1127,,,,,,,,,,,,,0,,,,,T,terres,,,1792,1.291269,44.652187
2020-682383,2020-10-19,000002,Vente,100000,,,LES FOURCARIES,B151,46340,46087,Dégagnac,46,,,460870000E1128,,,,,,,,,,,,,0,,,,,T,terres,,,398,1.290647,44.651682
2020-682457,2020-10-16,000001,Vente,83000,5344,,DEGAGNAC,B134,46340,46087,Dégagnac,46,,,460870000H1431,,,,,,,,,,,,,0,1,Maison,70,3,S,sols,,,215,1.312401,44.666469
2020-682457,2020-10-16,000001,Vente,83000,5344,,DEGAGNAC,B134,46340,46087,Dégagnac,46,,,460870000H1431,,,,,,,,,,,,,0,1,Maison,70,3,J,jardins,POTAG,Jardin potager,609,1.312401,44.666469
2020-682457,2020-10-16,000001,Vente,83000,,,DEGAGNAC,B134,46340,46087,Dégagnac,46,,,460870000H1434,,,,,,,,,,,,,0,,,,,S,sols,,,248,1.312217,44.666388
2020-682757,2020-10-30,000001,Vente,105000,5468,F,LE MAS,B203,46340,46087,Dégagnac,46,,,460870000F0998,,,,,,,,,,,,,0,1,Maison,115,5,S,sols,,,200,1.287187,44.661094
2020-682757,2020-10-30,000001,Vente,105000,,,LE MAS,B203,46340,46087,Dégagnac,46,,,460870000F1008,,,,,,,,,,,,,0,,,,,T,terres,,,460,1.287432,44.660907
2020-682757,2020-10-30,000001,Vente,105000,5518,F,LE MAS,B203,46340,46087,Dégagnac,46,,,460870000F1554,,,,,,,,,,,,,0,3,Dépendance,,0,S,sols,,,100,1.287452,44.661095
2020-682757,2020-10-30,000001,Vente,105000,5518,F,LE MAS,B203,46340,46087,Dégagnac,46,,,460870000F1554,,,,,,,,,,,,,0,3,Dépendance,,0,T,terres,,,830,1.287452,44.661095
2020-682872,2020-07-03,000001,Adjudication,27000,,,DEGAGNAC,B134,46340,46087,Dégagnac,46,,,460870000H0789,,,,,,,,,,,,,0,,,,,T,terres,,,430,1.313594,44.667521
2020-682872,2020-07-03,000001,Adjudication,27000,5047,,DEGAGNAC,B134,46340,46087,Dégagnac,46,,,460870000H1709,,,,,,,,,,,,,0,1,Maison,100,5,S,sols,,,155,1.314069,44.665716
2020-682872,2020-07-03,000001,Adjudication,27000,5047,,DEGAGNAC,B134,46340,46087,Dégagnac,46,,,460870000H1709,,,,,,,,,,,,,0,3,Dépendance,,0,S,sols,,,155,1.314069,44.665716
2020-683017,2020-11-25,000001,Vente,500,,,LES VIGNALS,B373,46340,46087,Dégagnac,46,,,460870000G0435,,,,,,,,,,,,,0,,,,,BT,taillis simples,,,1300,1.32154,44.679447
2020-683326,2020-12-11,000001,Vente,69000,,,DEGAGNAC,B134,46340,46087,Dégagnac,46,,,460870000H0789,,,,,,,,,,,,,0,,,,,T,terres,,,430,1.313594,44.667521
2020-683326,2020-12-11,000001,Vente,69000,5047,,DEGAGNAC,B134,46340,46087,Dégagnac,46,,,460870000H1709,,,,,,,,,,,,,0,3,Dépendance,,0,S,sols,,,155,1.314069,44.665716
2020-683326,2020-12-11,000001,Vente,69000,5047,,DEGAGNAC,B134,46340,46087,Dégagnac,46,,,460870000H1709,,,,,,,,,,,,,0,1,Maison,100,5,S,sols,,,155,1.314069,44.665716
2020-683363,2020-12-11,000001,Vente,25000,,,LE PECH ROUDUER,B267,46340,46087,Dégagnac,46,,,460870000A0098,,,,,,,,,,,,,0,,,,,BT,taillis simples,,,940,1.335235,44.699283
2020-683363,2020-12-11,000001,Vente,25000,,,LE PECH ROUDUER,B267,46340,46087,Dégagnac,46,,,460870000A0099,,,,,,,,,,,,,0,,,,,BT,taillis simples,,,360,1.335384,44.699189
2020-683363,2020-12-11,000001,Vente,25000,,,LE COMBEL DE L ASE,B100,46340,46087,Dégagnac,46,,,460870000A0255,,,,,,,,,,,,,0,,,,,L,landes,,,1850,1.329443,44.687907
2020-683363,2020-12-11,000001,Vente,25000,,,LE ROC OU LA COMBE,B330,46340,46087,Dégagnac,46,,,460870000A0347,,,,,,,,,,,,,0,,,,,BT,taillis simples,,,1380,1.333355,44.696087
2020-683363,2020-12-11,000001,Vente,25000,,,LA MASUQUE,B221,46340,46087,Dégagnac,46,,,460870000F0476,,,,,,,,,,,,,0,,,,,P,prés,,,1935,1.310274,44.657538
2020-683363,2020-12-11,000001,Vente,25000,,,LA MASUQUE,B221,46340,46087,Dégagnac,46,,,460870000F0478,,,,,,,,,,,,,0,,,,,BT,taillis simples,,,2230,1.310527,44.657159
2020-683363,2020-12-11,000001,Vente,25000,,,PECH CARDOU,B256,46340,46087,Dégagnac,46,,,460870000G1022,,,,,,,,,,,,,0,,,,,T,terres,,,975,1.294404,44.693823
2020-683363,2020-12-11,000001,Vente,25000,,,PECH CARDOU,B256,46340,46087,Dégagnac,46,,,460870000G1023,,,,,,,,,,,,,0,,,,,L,landes,,,2910,1.294458,44.693596
2020-683363,2020-12-11,000001,Vente,25000,,,PECH CARDOU,B256,46340,46087,Dégagnac,46,,,460870000G1028,,,,,,,,,,,,,0,,,,,L,landes,,,1215,1.293977,44.693474
2020-683363,2020-12-11,000001,Vente,25000,,,PECH CARDOU,B256,46340,46087,Dégagnac,46,,,460870000G1033,,,,,,,,,,,,,0,,,,,L,landes,,,7070,1.295865,44.692455
2020-683363,2020-12-11,000001,Vente,25000,,,PECH CARDOU,B256,46340,46087,Dégagnac,46,,,460870000G1036,,,,,,,,,,,,,0,,,,,L,landes,,,2040,1.294666,44.692008
2020-683363,2020-12-11,000001,Vente,25000,,,PECH CARDOU,B256,46340,46087,Dégagnac,46,,,460870000G1037,,,,,,,,,,,,,0,,,,,L,landes,,,1529,1.294948,44.691857
2020-683363,2020-12-11,000001,Vente,25000,,,PECH CARDOU,B256,46340,46087,Dégagnac,46,,,460870000G1054,,,,,,,,,,,,,0,,,,,BT,taillis simples,,,1720,1.29691,44.692675
2020-683363,2020-12-11,000001,Vente,25000,,,PECH CARDOU,B256,46340,46087,Dégagnac,46,,,460870000G1063,,,,,,,,,,,,,0,,,,,BT,taillis simples,,,1060,1.298364,44.692188
2020-683363,2020-12-11,000001,Vente,25000,,,PECH CARDOU,B256,46340,46087,Dégagnac,46,,,460870000G1070,,,,,,,,,,,,,0,,,,,T,terres,,,765,1.299294,44.692225
2020-683363,2020-12-11,000001,Vente,25000,,,PECH CARDOU,B256,46340,46087,Dégagnac,46,,,460870000G1071,,,,,,,,,,,,,0,,,,,BF,futaies feuillues,,,5564,1.298801,44.69328
2020-683363,2020-12-11,000001,Vente,25000,,,PECH CARDOU,B256,46340,46087,Dégagnac,46,,,460870000G1071,,,,,,,,,,,,,0,,,,,T,terres,,,2106,1.298801,44.69328
2020-683363,2020-12-11,000001,Vente,25000,,,PECH CARDOU,B256,46340,46087,Dégagnac,46,,,460870000G1072,,,,,,,,,,,,,0,,,,,T,terres,,,3840,1.298345,44.693639
2020-683363,2020-12-11,000001,Vente,25000,,,PECH CARDOU,B256,46340,46087,Dégagnac,46,,,460870000G1076,,,,,,,,,,,,,0,,,,,BT,taillis simples,,,780,1.29893,44.693619
2020-683363,2020-12-11,000001,Vente,25000,,,PECH CARDOU,B256,46340,46087,Dégagnac,46,,,460870000G1077,,,,,,,,,,,,,0,,,,,BT,taillis simples,,,1465,1.299186,44.693191
2020-683363,2020-12-11,000001,Vente,25000,,,PECH CARDOU,B256,46340,46087,Dégagnac,46,,,460870000G1079,,,,,,,,,,,,,0,,,,,T,terres,,,1650,1.299771,44.69254
2020-683363,2020-12-11,000001,Vente,25000,,,PECH CARDOU,B256,46340,46087,Dégagnac,46,,,460870000G1080,,,,,,,,,,,,,0,,,,,T,terres,,,2792,1.300196,44.692643
2020-683363,2020-12-11,000001,Vente,25000,,,PECH CARDOU,B256,46340,46087,Dégagnac,46,,,460870000G1516,,,,,,,,,,,,,0,,,,,BT,taillis simples,,,4250,1.299345,44.693683
2020-683483,2020-12-11,000001,Vente,40000,,,LA CHAUDIERE,B078,46340,46087,Dégagnac,46,,,460870000H0723,,,,,,,,,,,,,0,,,,,BT,taillis simples,,,8830,1.316582,44.666904
2020-683483,2020-12-11,000001,Vente,40000,,,VERTILLAC,B372,46340,46087,Dégagnac,46,,,460870000H0728,,,,,,,,,,,,,0,,,,,T,terres,,,6770,1.3144,44.667834
2020-683483,2020-12-11,000001,Vente,40000,5427,,VERTILLAC,B372,46340,46087,Dégagnac,46,,,460870000H0729,,,,,,,,,,,,,0,1,Maison,32,1,S,sols,,,25,1.314698,44.668146
2020-683483,2020-12-11,000001,Vente,40000,,,VERTILLAC,B372,46340,46087,Dégagnac,46,,,460870000H0730,,,,,,,,,,,,,0,,,,,T,terres,,,2450,1.314451,44.668133
2020-683483,2020-12-11,000001,Vente,40000,,,DEGAGNAC,B134,46340,46087,Dégagnac,46,,,460870000H0787,,,,,,,,,,,,,0,,,,,L,landes,,,290,1.31306,44.667001
2020-683483,2020-12-11,000001,Vente,40000,,,DEGAGNAC,B134,46340,46087,Dégagnac,46,,,460870000H0788,,,,,,,,,,,,,0,,,,,T,terres,,,2690,1.313236,44.667244
2020-683521,2020-12-10,000001,Vente,40000,,,LES COTES,B117,46340,46087,Dégagnac,46,,,460870000H0712,,,,,,,,,,,,,0,,,,,BT,taillis simples,,,2995,1.320529,44.665221
2020-683521,2020-12-10,000001,Vente,40000,,,LES COTES,B117,46340,46087,Dégagnac,46,,,460870000H0713,,,,,,,,,,,,,0,,,,,BT,taillis simples,,,810,1.321068,44.665403
2020-683521,2020-12-10,000001,Vente,40000,,,LES COTES,B117,46340,46087,Dégagnac,46,,,460870000H0715,,,,,,,,,,,,,0,,,,,BT,taillis simples,,,2040,1.31989,44.665483
2020-683521,2020-12-10,000001,Vente,40000,5055,,LES COTES,B117,46340,46087,Dégagnac,46,,,460870000H0716,,,,,,,,,,,,,0,1,Maison,50,3,S,sols,,,1410,1.319748,44.665431
2020-683531,2020-12-11,000001,Vente,64500,,,MOULIN DE LATOUR,B241,46340,46087,Dégagnac,46,,,460870000G0567,,,,,,,,,,,,,0,,,,,L,landes,,,715,1.30605,44.668959
2020-683531,2020-12-11,000001,Vente,64500,,,LES PRADES,B307,46340,46087,Dégagnac,46,,,460870000G0596,,,,,,,,,,,,,0,,,,,L,landes,,,895,1.306772,44.668692
2020-683531,2020-12-11,000001,Vente,64500,5520,F,LES PRADES,B307,46340,46087,Dégagnac,46,,,460870000G0597,,,,,,,,,,,,,0,1,Maison,55,2,S,sols,,,50,1.306824,44.668567
2020-683531,2020-12-11,000001,Vente,64500,,,LES PRADES,B307,46340,46087,Dégagnac,46,,,460870000G1571,,,,,,,,,,,,,0,,,,,S,sols,,,35,1.306877,44.668535
2020-683680,2020-12-23,000001,Vente,120800,5669,F,VERGNES,B371,46340,46087,Dégagnac,46,,,460870000H1669,,,,,,,,,,,,,0,1,Maison,74,4,T,terres,,,241,1.332432,44.665902
2020-683680,2020-12-23,000001,Vente,120800,5669,F,VERGNES,B371,46340,46087,Dégagnac,46,,,460870000H1669,,,,,,,,,,,,,0,1,Maison,74,4,S,sols,,,500,1.332432,44.665902
2020-683680,2020-12-23,000001,Vente,120800,,,LABARTHE,B182,46340,46087,Dégagnac,46,,,460870000H1672,,,,,,,,,,,,,0,,,,,S,sols,,,130,1.332415,44.666029
