id_mutation,date_mutation,numero_disposition,nature_mutation,valeur_fonciere,adresse_numero,adresse_suffixe,adresse_nom_voie,adresse_code_voie,code_postal,code_commune,nom_commune,code_departement,ancien_code_commune,ancien_nom_commune,id_parcelle,ancien_id_parcelle,numero_volume,lot1_numero,lot1_surface_carrez,lot2_numero,lot2_surface_carrez,lot3_numero,lot3_surface_carrez,lot4_numero,lot4_surface_carrez,lot5_numero,lot5_surface_carrez,nombre_lots,code_type_local,type_local,surface_reelle_bati,nombre_pieces_principales,code_nature_culture,nature_culture,code_nature_culture_speciale,nature_culture_speciale,surface_terrain,longitude,latitude
2020-692184,2020-02-07,000001,Vente,125000,5002,,ECHALOUPPES,B177,48310,48044,Chauchailles,48,,,480440000C0599,,,,,,,,,,,,,0,1,Maison,48,3,S,sols,,,52,3.052868,44.783173
2020-692184,2020-02-07,000001,Vente,125000,,,ECHALOUPPES,B177,48310,48044,Chauchailles,48,,,480440000C0824,,,,,,,,,,,,,0,,,,,S,sols,,,38,3.052812,44.783106
2020-692184,2020-02-07,000001,Vente,125000,5103,,ECHALOUPPES,B177,48310,48044,Chauchailles,48,,,480440000C1031,,,,,,,,,,,,,0,3,Dépendance,,0,S,sols,,,59,3.052892,44.783241
2020-692184,2020-02-07,000001,Vente,125000,,,ECHALOUPPES,B177,48310,48044,Chauchailles,48,,,480440000C1032,,,,,,,,,,,,,0,,,,,PA,pâtures,PATUR,Pâture plantée,14,3.052902,44.783158
2020-692184,2020-02-07,000001,Vente,125000,,,ECHALOUPPES,B177,48310,48044,Chauchailles,48,,,480440000C1035,,,,,,,,,,,,,0,,,,,PA,pâtures,PATUR,Pâture plantée,951,3.052832,44.782886
2020-692184,2020-02-07,000001,Vente,125000,,,ECHALOUPPES,B177,48310,48044,Chauchailles,48,,,480440000C1037,,,,,,,,,,,,,0,,,,,PA,pâtures,PATUR,Pâture plantée,60,3.052999,44.782959
2020-692316,2020-02-28,000001,Vente,80000,,,SALECRUX,B451,48310,48044,Chauchailles,48,,,48044000AE0068,,,,,,,,,,,,,0,,,,,J,jardins,,,95,3.066304,44.794462
2020-692316,2020-02-28,000001,Vente,80000,,,SALECRUX,B451,48310,48044,Chauchailles,48,,,48044000AE0069,,,,,,,,,,,,,0,,,,,J,jardins,,,112,3.066158,44.79439
2020-692316,2020-02-28,000001,Vente,80000,,,SALECRUX,B451,48310,48044,Chauchailles,48,,,48044000AE0070,,,,,,,,,,,,,0,,,,,S,sols,,,695,3.066392,44.794298
2020-692316,2020-02-28,000001,Vente,80000,5021,,SALECRUX,B451,48310,48044,Chauchailles,48,,,48044000AE0155,,,,,,,,,,,,,0,1,Maison,100,1,S,sols,,,410,3.066399,44.79451
2020-692316,2020-02-28,000001,Vente,80000,,,SALECRUX,B451,48310,48044,Chauchailles,48,,,48044000AE0185,,,,,,,,,,,,,0,,,,,J,jardins,,,100,3.066549,44.79456
2020-693088,2020-08-05,000001,Vente,20000,,,DEVEZE DEL BEGONAL,B168,48310,48044,Chauchailles,48,,,48044000AE0010,,,,,,,,,,,,,0,,,,,PA,pâtures,PATUR,Pâture plantée,3379,3.063632,44.800425
2020-693088,2020-08-05,000001,Vente,20000,,,DEVEZE DEL BEGONAL,B168,48310,48044,Chauchailles,48,,,48044000AE0011,,,,,,,,,,,,,0,,,,,PA,pâtures,PATUR,Pâture plantée,4689,3.063705,44.799102
2020-693088,2020-08-05,000001,Vente,20000,,,DEVEZE DEL BEGONAL,B168,48310,48044,Chauchailles,48,,,48044000AE0011,,,,,,,,,,,,,0,,,,,PA,pâtures,PATUR,Pâture plantée,9376,3.063705,44.799102
2020-693088,2020-08-05,000001,Vente,20000,,,SAUVEGARDE,B456,48310,48044,Chauchailles,48,,,48044000AE0020,,,,,,,,,,,,,0,,,,,PA,pâtures,PATUR,Pâture plantée,7130,3.061662,44.795881
2020-693088,2020-08-05,000001,Vente,20000,,,LA COUOSTE,B136,48310,48044,Chauchailles,48,,,48044000AE0021,,,,,,,,,,,,,0,,,,,PA,pâtures,PATUR,Pâture plantée,4100,3.062171,44.795563
2020-693088,2020-08-05,000001,Vente,20000,,,PRAT D AMBLARD,B363,48310,48044,Chauchailles,48,,,48044000AE0028,,,,,,,,,,,,,0,,,,,P,prés,,,2530,3.063652,44.794545
2020-693088,2020-08-05,000001,Vente,20000,,,PRAT D AMBLARD,B363,48310,48044,Chauchailles,48,,,48044000AE0028,,,,,,,,,,,,,0,,,,,P,prés,,,2530,3.063652,44.794545
2020-693088,2020-08-05,000001,Vente,20000,,,PRAT D AMBLARD,B363,48310,48044,Chauchailles,48,,,48044000AE0028,,,,,,,,,,,,,0,,,,,P,prés,,,2530,3.063652,44.794545
2020-693088,2020-08-05,000001,Vente,20000,,,LA COUOSTE,B136,48310,48044,Chauchailles,48,,,48044000AE0029,,,,,,,,,,,,,0,,,,,P,prés,,,4335,3.062663,44.794245
2020-693088,2020-08-05,000001,Vente,20000,,,LA COUOSTE,B136,48310,48044,Chauchailles,48,,,48044000AE0030,,,,,,,,,,,,,0,,,,,J,jardins,,,118,3.063197,44.794318
2020-693088,2020-08-05,000001,Vente,20000,,,LA COUOSTE,B136,48310,48044,Chauchailles,48,,,48044000AE0031,,,,,,,,,,,,,0,,,,,J,jardins,,,475,3.063181,44.794506
2020-693088,2020-08-05,000001,Vente,20000,,,LA COUOSTE,B136,48310,48044,Chauchailles,48,,,48044000AE0032,,,,,,,,,,,,,0,,,,,J,jardins,,,170,3.063137,44.794669
2020-693088,2020-08-05,000001,Vente,20000,,,LA COUOSTE,B136,48310,48044,Chauchailles,48,,,48044000AE0033,,,,,,,,,,,,,0,,,,,J,jardins,,,175,3.063133,44.79475
2020-693088,2020-08-05,000001,Vente,20000,,,LA PARONNETTE,B330,48310,48044,Chauchailles,48,,,48044000AE0045,,,,,,,,,,,,,0,,,,,P,prés,,,6870,3.065769,44.793058
2020-693088,2020-08-05,000001,Vente,20000,,,PRAT PIBAS,B412,48310,48044,Chauchailles,48,,,48044000AE0142,,,,,,,,,,,,,0,,,,,L,landes,,,143,3.060145,44.793347
2020-693088,2020-08-05,000001,Vente,20000,,,PRAT PIBAS,B412,48310,48044,Chauchailles,48,,,48044000AE0143,,,,,,,,,,,,,0,,,,,L,landes,,,622,3.061293,44.793691
2020-693088,2020-08-05,000001,Vente,20000,,,PRAT PIBAS,B412,48310,48044,Chauchailles,48,,,48044000AE0143,,,,,,,,,,,,,0,,,,,PA,pâtures,PATUR,Pâture plantée,623,3.061293,44.793691
2020-693088,2020-08-05,000001,Vente,20000,,,PRAT PIBAS,B412,48310,48044,Chauchailles,48,,,48044000AE0144,,,,,,,,,,,,,0,,,,,P,prés,,,1186,3.061737,44.793837
2020-693088,2020-08-05,000001,Vente,20000,,,RECOULIERE,B424,48310,48044,Chauchailles,48,,,48044000AE0146,,,,,,,,,,,,,0,,,,,L,landes,,,25428,3.060909,44.794757
2020-693088,2020-08-05,000001,Vente,20000,,,LOU SAGNAS,B285,48310,48044,Chauchailles,48,,,48044000AE0156,,,,,,,,,,,,,0,,,,,PA,pâtures,PATUR,Pâture plantée,393,3.06128,44.796083
2020-693088,2020-08-05,000001,Vente,20000,,,LOU SAGNAS,B285,48310,48044,Chauchailles,48,,,48044000AE0158,,,,,,,,,,,,,0,,,,,L,landes,,,84,3.060846,44.795702
2020-693088,2020-08-05,000001,Vente,20000,,,LOU SAGNAS,B285,48310,48044,Chauchailles,48,,,48044000AE0160,,,,,,,,,,,,,0,,,,,PA,pâtures,PATUR,Pâture plantée,70,3.061569,44.796326
2020-693088,2020-08-05,000001,Vente,20000,,,SOGNE CUMINA,B458,48310,48044,Chauchailles,48,,,480440000C0102,,,,,,,,,,,,,0,,,,,P,prés,,,8455,3.070633,44.788045
2020-693088,2020-08-05,000001,Vente,20000,,,SOGNE CUMINA,B458,48310,48044,Chauchailles,48,,,480440000C0103,,,,,,,,,,,,,0,,,,,P,prés,,,4267,3.070004,44.78886
2020-693088,2020-08-05,000001,Vente,20000,,,SOGNE CUMINA,B458,48310,48044,Chauchailles,48,,,480440000C0104,,,,,,,,,,,,,0,,,,,T,terres,,,3776,3.070547,44.788716
2020-693088,2020-08-05,000001,Vente,20000,,,PRAT DE LA BOUGIE,B384,48310,48044,Chauchailles,48,,,480440000C0371,,,,,,,,,,,,,0,,,,,P,prés,,,3820,3.066494,44.789574
2020-693593,2020-10-13,000001,Vente,12,,,ECHALOUPPES,B177,48310,48044,Chauchailles,48,,,480440000C1112,,,,,,,,,,,,,0,,,,,S,sols,,,18,3.052833,44.783237
2020-693593,2020-10-13,000001,Vente,12,,,ECHALOUPPES,B177,48310,48044,Chauchailles,48,,,480440000C1113,,,,,,,,,,,,,0,,,,,S,sols,,,30,3.052744,44.783074
2020-693756,2020-10-30,000002,Vente,,,,CHAUCHAILLETTES,B078,48310,48044,Chauchailles,48,,,48044000AD0087,,,,,,,,,,,,,0,,,,,S,sols,,,19,3.078261,44.796032
2020-693756,2020-10-30,000003,Vente,,,,CHAUCHAILLETTES,B078,48310,48044,Chauchailles,48,,,48044000AD0087,,,,,,,,,,,,,0,,,,,S,sols,,,19,3.078261,44.796032
2020-693757,2020-10-30,000004,Vente,80000,5031,,CHAUCHAILLETTES,B078,48310,48044,Chauchailles,48,,,48044000AD0019,,,,,,,,,,,,,0,1,Maison,110,5,S,sols,,,788,3.077903,44.795894
2020-693757,2020-10-30,000004,Vente,80000,,,CHAUCHAILLETTES,B078,48310,48044,Chauchailles,48,,,48044000AD0021,,,,,,,,,,,,,0,,,,,J,jardins,,,350,3.077578,44.795695
2020-693757,2020-10-30,000004,Vente,80000,,,CHAUCHAILLETTES,B078,48310,48044,Chauchailles,48,,,48044000AD0087,,,,,,,,,,,,,0,,,,,S,sols,,,19,3.078261,44.796032
2020-693757,2020-10-30,000004,Vente,80000,,,CHAUCHAILLETTES,B078,48310,48044,Chauchailles,48,,,48044000AD0105,,,,,,,,,,,,,0,,,,,S,sols,,,2,3.0775,44.795792
2020-693757,2020-10-30,000004,Vente,80000,,,CHAUCHAILLETTES,B078,48310,48044,Chauchailles,48,,,48044000AD0106,,,,,,,,,,,,,0,,,,,S,sols,,,3,3.077506,44.79582
2020-693969,2020-11-07,000001,Vente,175,,,LAS CHAMS,B218,48310,48044,Chauchailles,48,,,480440000C1099,,,,,,,,,,,,,0,,,,,L,landes,,,936,3.073469,44.772587
2020-693969,2020-11-07,000001,Vente,175,,,LAS CHAMS,B218,48310,48044,Chauchailles,48,,,480440000C1100,,,,,,,,,,,,,0,,,,,L,landes,,,1525,3.07347,44.772508
