id_mutation,date_mutation,numero_disposition,nature_mutation,valeur_fonciere,adresse_numero,adresse_suffixe,adresse_nom_voie,adresse_code_voie,code_postal,code_commune,nom_commune,code_departement,ancien_code_commune,ancien_nom_commune,id_parcelle,ancien_id_parcelle,numero_volume,lot1_numero,lot1_surface_carrez,lot2_numero,lot2_surface_carrez,lot3_numero,lot3_surface_carrez,lot4_numero,lot4_surface_carrez,lot5_numero,lot5_surface_carrez,nombre_lots,code_type_local,type_local,surface_reelle_bati,nombre_pieces_principales,code_nature_culture,nature_culture,code_nature_culture_speciale,nature_culture_speciale,surface_terrain,longitude,latitude
2020-945623,2020-01-03,000001,Vente,4000,,,COUME D AYGUEBONNE OUEST,B020,66220,66077,Fenouillet,66,,,660770000A0048,,,,,,,,,,,,,0,,,,,BR,futaies résineuses,,,1610,2.359478,42.792486
2020-945623,2020-01-03,000001,Vente,4000,9001,,COUME D AYGUEBONNE OUEST,B020,66220,66077,Fenouillet,66,,,660770000A0053,,,,,,,,,,,,,0,1,Maison,10,1,BR,futaies résineuses,,,900,2.359951,42.792568
2020-947704,2020-06-04,000001,Vente,15000,9000,,LA NADULLE,B040,66220,66077,Fenouillet,66,,,660770000A0723,,,,,,,,,,,,,0,4,Local industriel. commercial ou assimilé,,,L,landes,,,2770,2.367869,42.779961
2020-947704,2020-06-04,000001,Vente,15000,,,LA NADULLE,B040,66220,66077,Fenouillet,66,,,660770000A0729,,,,,,,,,,,,,0,,,,,T,terres,,,395,2.368401,42.779261
2020-947704,2020-06-04,000001,Vente,15000,,,LA NADULLE,B040,66220,66077,Fenouillet,66,,,660770000A0731,,,,,,,,,,,,,0,,,,,T,terres,,,2430,2.367855,42.779362
2020-947704,2020-06-04,000001,Vente,15000,,,LA NADULLE,B040,66220,66077,Fenouillet,66,,,660770000A0732,,,,,,,,,,,,,0,,,,,P,prés,,,1520,2.367251,42.779185
2020-947704,2020-06-04,000001,Vente,15000,,,LA NADULLE,B040,66220,66077,Fenouillet,66,,,660770000A0733,,,,,,,,,,,,,0,,,,,T,terres,,,1850,2.36641,42.779219
2020-947704,2020-06-04,000001,Vente,15000,,,LA NADULLE,B040,66220,66077,Fenouillet,66,,,660770000A0734,,,,,,,,,,,,,0,,,,,L,landes,,,2550,2.366093,42.77936
2020-947704,2020-06-04,000001,Vente,15000,,,LA NADULLE,B040,66220,66077,Fenouillet,66,,,660770000A0738,,,,,,,,,,,,,0,,,,,L,landes,,,1000,2.36454,42.779061
2020-947704,2020-06-04,000001,Vente,15000,,,LA NADULLE,B040,66220,66077,Fenouillet,66,,,660770000A0741,,,,,,,,,,,,,0,,,,,L,landes,,,2250,2.363381,42.779077
2020-947704,2020-06-04,000001,Vente,15000,,,LA NADULLE,B040,66220,66077,Fenouillet,66,,,660770000A0742,,,,,,,,,,,,,0,,,,,L,landes,,,1600,2.363098,42.779105
2020-947704,2020-06-04,000001,Vente,15000,,,LA NADULLE,B040,66220,66077,Fenouillet,66,,,660770000A0759,,,,,,,,,,,,,0,,,,,L,landes,,,8135,2.36071,42.77827
2020-947704,2020-06-04,000001,Vente,15000,,,LA NADULLE,B040,66220,66077,Fenouillet,66,,,660770000A0766,,,,,,,,,,,,,0,,,,,L,landes,,,1375,2.359882,42.777864
2020-947704,2020-06-04,000001,Vente,15000,,,LOU PRAT DEL REY,B035,66220,66077,Fenouillet,66,,,660770000B0316,,,,,,,,,,,,,0,,,,,VI,vignes,,,6420,2.38404,42.786612
2020-947704,2020-06-04,000001,Vente,15000,,,LOU PRAT DEL REY,B035,66220,66077,Fenouillet,66,,,660770000B0386,,,,,,,,,,,,,0,,,,,P,prés,,,1075,2.380718,42.786483
2020-947704,2020-06-04,000001,Vente,15000,34,,LA FONTANASSE,B024,66220,66077,Fenouillet,66,,,660770000B0737,,,,,,,,,,,,,0,3,Dépendance,,0,S,sols,,,20,2.413238,42.784841
2020-947704,2020-06-04,000001,Vente,15000,,,LA FONTANASSE,B024,66220,66077,Fenouillet,66,,,660770000B0739,,,,,,,,,,,,,0,,,,,L,landes,,,4980,2.413875,42.784068
2020-947704,2020-06-04,000001,Vente,15000,38,,RIVES DEL MAS,B043,66220,66077,Fenouillet,66,,,660770000B0743,,,,,,,,,,,,,0,4,Local industriel. commercial ou assimilé,,,CA,carrières,,,15865,2.412729,42.7842
2020-947704,2020-06-04,000001,Vente,15000,35,,RIVES DEL MAS,B043,66220,66077,Fenouillet,66,,,660770000B0744,,,,,,,,,,,,,0,1,Maison,23,0,S,sols,,,55,2.412516,42.784172
2020-947704,2020-06-04,000001,Vente,15000,37,,RIVES DEL MAS,B043,66220,66077,Fenouillet,66,,,660770000B0746,,,,,,,,,,,,,0,1,Maison,22,1,S,sols,,,27,2.41243,42.784273
2020-947704,2020-06-04,000001,Vente,15000,,,RIVES DEL MAS,B043,66220,66077,Fenouillet,66,,,660770000B0754,,,,,,,,,,,,,0,,,,,L,landes,,,2570,2.411532,42.784141
2020-947704,2020-06-04,000001,Vente,15000,,,RIVES DEL MAS,B043,66220,66077,Fenouillet,66,,,660770000B0755,,,,,,,,,,,,,0,,,,,L,landes,,,7050,2.412112,42.783419
2020-947704,2020-06-04,000001,Vente,15000,,,RIVES DEL MAS,B043,66220,66077,Fenouillet,66,,,660770000B0763,,,,,,,,,,,,,0,,,,,L,landes,,,4600,2.411318,42.784804
2020-947704,2020-06-04,000001,Vente,15000,,,RIVES DEL MAS,B043,66220,66077,Fenouillet,66,,,660770000B0768,,,,,,,,,,,,,0,,,,,L,landes,,,4690,2.411432,42.78559
2020-947704,2020-06-04,000001,Vente,15000,,,RIVES DEL MAS,B043,66220,66077,Fenouillet,66,,,660770000B0769,,,,,,,,,,,,,0,,,,,L,landes,,,2370,2.411931,42.785462
2020-947704,2020-06-04,000001,Vente,15000,,,BAC DEL TEL,B003,66220,66077,Fenouillet,66,,,660770000B1169,,,,,,,,,,,,,0,,,,,L,landes,,,770,2.364497,42.778569
2020-947704,2020-06-04,000001,Vente,15000,,,BAC DEL TEL,B003,66220,66077,Fenouillet,66,,,660770000B1173,,,,,,,,,,,,,0,,,,,L,landes,,,3580,2.366294,42.77861
2020-947704,2020-06-04,000001,Vente,15000,,,SOULA DEL TEL,B061,66220,66077,Fenouillet,66,,,660770000B1175,,,,,,,,,,,,,0,,,,,L,landes,,,1300,2.367218,42.778884
2020-947704,2020-06-04,000001,Vente,15000,,,SOULA DEL TEL,B061,66220,66077,Fenouillet,66,,,660770000B1176,,,,,,,,,,,,,0,,,,,T,terres,,,1090,2.367741,42.778738
2020-947704,2020-06-04,000001,Vente,15000,,,SOULA DEL TEL,B061,66220,66077,Fenouillet,66,,,660770000B1179,,,,,,,,,,,,,0,,,,,T,terres,,,1030,2.366933,42.777566
2020-947704,2020-06-04,000001,Vente,15000,,,LA GNANE,B026,66220,66077,Fenouillet,66,,,660770000B1241,,,,,,,,,,,,,0,,,,,P,prés,,,5010,2.368698,42.778936
2020-947704,2020-06-04,000001,Vente,15000,,,LA GNANE,B026,66220,66077,Fenouillet,66,,,660770000B1242,,,,,,,,,,,,,0,,,,,L,landes,,,2580,2.368902,42.778927
2020-947704,2020-06-04,000001,Vente,15000,,,LA GNANE,B026,66220,66077,Fenouillet,66,,,660770000B1243,,,,,,,,,,,,,0,,,,,S,sols,,,30,2.369088,42.779181
2020-947704,2020-06-04,000001,Vente,15000,,,LOU PRAT DEL REY,B035,66220,66077,Fenouillet,66,,,660770000B1335,,,,,,,,,,,,,0,,,,,VE,vergers,,,530,2.382839,42.789691
2020-947704,2020-06-04,000001,Vente,15000,,,LOU PRAT DEL REY,B035,66220,66077,Fenouillet,66,,,660770000B1336,,,,,,,,,,,,,0,,,,,VI,vignes,,,3980,2.38287,42.789453
2020-950381,2020-10-27,000001,Vente,130000,22,,LA VILASSE,B065,66220,66077,Fenouillet,66,,,660770000B1411,,,,,,,,,,,,,0,1,Maison,135,3,S,sols,,,155,2.380939,42.792202
2020-950381,2020-10-27,000001,Vente,130000,,,LA VILASSE,B065,66220,66077,Fenouillet,66,,,660770000B1477,,,,,,,,,,,,,0,,,,,S,sols,,,11,,
2020-950683,2020-11-16,000001,Vente,89000,23,,LA VILASSE,B065,66220,66077,Fenouillet,66,,,660770000B1321,,,,,,,,,,,,,0,1,Maison,72,3,S,sols,,,88,2.380695,42.792005
