id_mutation,date_mutation,numero_disposition,nature_mutation,valeur_fonciere,adresse_numero,adresse_suffixe,adresse_nom_voie,adresse_code_voie,code_postal,code_commune,nom_commune,code_departement,ancien_code_commune,ancien_nom_commune,id_parcelle,ancien_id_parcelle,numero_volume,lot1_numero,lot1_surface_carrez,lot2_numero,lot2_surface_carrez,lot3_numero,lot3_surface_carrez,lot4_numero,lot4_surface_carrez,lot5_numero,lot5_surface_carrez,nombre_lots,code_type_local,type_local,surface_reelle_bati,nombre_pieces_principales,code_nature_culture,nature_culture,code_nature_culture_speciale,nature_culture_speciale,surface_terrain,longitude,latitude
2020-1021791,2020-01-17,000001,Vente,89120,5285,,IMMEUBLE LE CHARBONNEL,A010,73480,73040,Bessans,73,,,730400000H1560,,,8,,,,,,,,,,1,2,Appartement,27,1,,,,,,7.000017,45.324201
2020-1021884,2020-01-15,000001,Vente,46000,,,GLAIRES SECHES,B143,73480,73040,Bessans,73,,,730400000H2851,,,,,,,,,,,,,0,,,,,P,prés,,,322,6.989197,45.318478
2020-1021884,2020-01-15,000001,Vente,46000,,,GLAIRES SECHES,B143,73480,73040,Bessans,73,,,730400000H2854,,,,,,,,,,,,,0,,,,,P,prés,,,329,6.989316,45.318495
2020-1021884,2020-01-15,000001,Vente,46000,,,GLAIRES SECHES,B143,73480,73040,Bessans,73,,,730400000H2856,,,,,,,,,,,,,0,,,,,P,prés,,,341,6.989361,45.318569
2020-1022273,2020-01-27,000001,Vente,85000,5285,,IMM L ALBARON,A006,73480,73040,Bessans,73,,,730400000H1560,,,231,,,,,,,,,,1,2,Appartement,28,1,,,,,,7.000017,45.324201
2020-1022899,2020-02-21,000001,Vente,357050,5437,,RUE DU PRE DE L'HUILE,0153,73480,73040,Bessans,73,,,730400000H2765,,,,,,,,,,,,,0,1,Maison,160,5,S,sols,,,530,6.995921,45.31834
2020-1024757,2020-04-01,000001,Vente,195000,,,LE VILLARON,B326,73480,73040,Bessans,73,,,730400000B0961,,,,,,,,,,,,,0,,,,,P,prés,,,157,7.013628,45.333206
2020-1024757,2020-04-01,000001,Vente,195000,5214,,LE VILLARON,B326,73480,73040,Bessans,73,,,730400000B0970,,,2,47.5,,,,,,,,,1,2,Appartement,45,3,,,,,,7.013681,45.33335
2020-1024757,2020-04-01,000001,Vente,195000,,,LE VILLARON,B326,73480,73040,Bessans,73,,,730400000B1448,,,,,,,,,,,,,0,,,,,P,prés,,,133,7.013537,45.333291
2020-1024757,2020-04-01,000001,Vente,195000,,,LE VILLARON,B326,73480,73040,Bessans,73,,,730400000B1449,,,,,,,,,,,,,0,,,,,P,prés,,,302,7.013335,45.333172
2020-1024757,2020-04-01,000001,Vente,195000,,,LE VILLARON,B326,73480,73040,Bessans,73,,,730400000B1454,,,,,,,,,,,,,0,,,,,S,sols,,,7,7.013606,45.333381
2020-1027817,2020-06-22,000001,Vente,110000,5285,,IMM L ALBARON,A006,73480,73040,Bessans,73,,,730400000H1560,,,325,34.91,,,,,,,,,1,2,Appartement,36,2,,,,,,7.000017,45.324201
2020-1028306,2020-07-15,000001,Vente,170000,5425,,RUE SAINT ETIENNE,0200,73480,73040,Bessans,73,,,730400000H2521,,,21,40.11,,,,,,,,,1,2,Appartement,40,2,,,,,,7.001184,45.324124
2020-1028306,2020-07-15,000001,Vente,170000,5425,,RUE SAINT ETIENNE,0200,73480,73040,Bessans,73,,,730400000H2521,,,3,,,,,,,,,,1,3,Dépendance,,0,,,,,,7.001184,45.324124
2020-1028647,2020-08-03,000001,Vente,1000,5206,,RUE DU PETIT SAINT JEAN,0120,73480,73040,Bessans,73,,,730400000H0775,,,14,,,,,,,,,,1,2,Appartement,19,1,,,,,,6.994842,45.321579
2020-1029007,2020-08-06,000001,Vente,180000,5358,,CHAUDANNE,B058,73480,73040,Bessans,73,,,730400000H0177,,,10,55.4,12,,,,,,,,2,2,Appartement,58,3,,,,,,6.990395,45.317835
2020-1029632,2020-08-17,000001,Vente,90000,5285,,IMM L ALBARON,A006,73480,73040,Bessans,73,,,730400000H1560,,,215,27.39,,,,,,,,,1,2,Appartement,27,1,,,,,,7.000017,45.324201
2020-1030896,2020-09-14,000001,Vente,20000,,,AVEROLLE,B009,73480,73040,Bessans,73,,,730400000T0130,,,,,,,,,,,,,0,,,,,P,prés,,,290,7.068393,45.303648
2020-1030896,2020-09-14,000001,Vente,20000,5255,,AVEROLLE,B009,73480,73040,Bessans,73,,,730400000T0131,,,,,,,,,,,,,0,1,Maison,20,1,S,sols,,,1000,7.068872,45.303429
2020-1030896,2020-09-14,000001,Vente,20000,5255,,AVEROLLE,B009,73480,73040,Bessans,73,,,730400000T0131,,,,,,,,,,,,,0,1,Maison,20,1,P,prés,,,3000,7.068872,45.303429
2020-1031220,2020-10-06,000001,Vente,10000,5222,,LE VILLARON,B326,73480,73040,Bessans,73,,,730400000B1000,,,,,,,,,,,,,0,1,Maison,20,1,S,sols,,,246,7.014176,45.332758
2020-1031763,2020-09-25,000001,Vente,100000,5342,,CHAUDANNE,B058,73480,73040,Bessans,73,,,730400000H0182,,,1,,11,26.91,,,,,,,2,2,Appartement,29,1,,,,,,6.991518,45.318314
2020-1031964,2020-10-16,000001,Vente,70000,5285,,IMM L ALBARON,A006,73480,73040,Bessans,73,,,730400000H1560,,,207,27.9,,,,,,,,,1,2,Appartement,27,1,,,,,,7.000017,45.324201
2020-1032115,2020-10-13,000001,Vente,33000,,,BESSANS,B022,73480,73040,Bessans,73,,,730400000H1830,,,,,,,,,,,,,0,,,,,P,prés,,,150,6.990985,45.319581
2020-1034143,2020-11-18,000001,Vente,700,,,LE COIN,B074,73480,73040,Bessans,73,,,730400000C0746,,,,,,,,,,,,,0,,,,,P,prés,,,9967,7.01119,45.339478
2020-1034145,2020-11-18,000001,Vente,5500,,,LE COIN,B074,73480,73040,Bessans,73,,,730400000C0030,,,,,,,,,,,,,0,,,,,P,prés,,,13625,7.011857,45.339555
2020-1034145,2020-11-18,000001,Vente,5500,,,LE MOLLARD,B193,73480,73040,Bessans,73,,,730400000C0043,,,,,,,,,,,,,0,,,,,P,prés,,,3162,7.014169,45.342546
2020-1034145,2020-11-18,000001,Vente,5500,,,LE MOLLARD,B193,73480,73040,Bessans,73,,,730400000C0043,,,,,,,,,,,,,0,,,,,P,prés,,,6323,7.014169,45.342546
2020-1034145,2020-11-18,000001,Vente,5500,,,LES COTES,B090,73480,73040,Bessans,73,,,730400000C0259,,,,,,,,,,,,,0,,,,,P,prés,,,9730,7.009275,45.347883
2020-1034145,2020-11-18,000001,Vente,5500,,,LE TAQUIN,B307,73480,73040,Bessans,73,,,730400000C0281,,,,,,,,,,,,,0,,,,,P,prés,,,2210,7.008804,45.345345
2020-1034255,2020-11-27,000001,Vente,210000,5150,,BESSANS,B022,73480,73040,Bessans,73,,,730400000H0535,,,,,,,,,,,,,0,1,Maison,46,2,S,sols,,,469,6.992196,45.320518
2020-1034255,2020-11-27,000001,Vente,210000,,,BESSANS,B022,73480,73040,Bessans,73,,,730400000H0536,,,,,,,,,,,,,0,,,,,L,landes,ROC,Rocs ou rochers,357,6.99192,45.320622
2020-1034520,2020-12-03,000001,Vente,72400,5285,,IMMEUBLE LE CHARBONNEL,A010,73480,73040,Bessans,73,,,730400000H1560,,,25,26.06,,,,,,,,,1,2,Appartement,27,1,,,,,,7.000017,45.324201
2020-1035668,2020-12-17,000001,Vente,180000,5421,,LES CONCHETTES,B084,73480,73040,Bessans,73,,,730400000H2496,,,35,,52,,6,,,,,,3,2,Appartement,40,2,,,,,,7.000604,45.323091
2020-1035743,2020-12-14,000001,Vente,96525,5285,,IMMEUBLE LE CHARBONNEL,A010,73480,73040,Bessans,73,,,730400000H1560,,,59,27.35,,,,,,,,,1,2,Appartement,27,1,,,,,,7.000017,45.324201
2020-1035925,2020-12-22,000001,Vente,175000,5421,,LES CONCHETTES,B084,73480,73040,Bessans,73,,,730400000H2496,,,23,,38,39.93,,,,,,,2,2,Appartement,40,2,,,,,,7.000604,45.323091
