id_mutation,date_mutation,numero_disposition,nature_mutation,valeur_fonciere,adresse_numero,adresse_suffixe,adresse_nom_voie,adresse_code_voie,code_postal,code_commune,nom_commune,code_departement,ancien_code_commune,ancien_nom_commune,id_parcelle,ancien_id_parcelle,numero_volume,lot1_numero,lot1_surface_carrez,lot2_numero,lot2_surface_carrez,lot3_numero,lot3_surface_carrez,lot4_numero,lot4_surface_carrez,lot5_numero,lot5_surface_carrez,nombre_lots,code_type_local,type_local,surface_reelle_bati,nombre_pieces_principales,code_nature_culture,nature_culture,code_nature_culture_speciale,nature_culture_speciale,surface_terrain,longitude,latitude
2020-1074558,2020-05-15,000001,Vente,115000,5074,A,BOURG DE BELLENGREVILLE,B006,76630,76071,Bellengreville,76,,,760710000B0302,,,,,,,,,,,,,0,1,Maison,82,4,AG,terrains d'agrément,,,610,1.215313,49.905738
2020-1074558,2020-05-15,000001,Vente,115000,5074,A,BOURG DE BELLENGREVILLE,B006,76630,76071,Bellengreville,76,,,760710000B0302,,,,,,,,,,,,,0,1,Maison,82,4,S,sols,,,70,1.215313,49.905738
2020-1074580,2020-06-26,000001,Vente,73000,40,,IMP DES HORTENSIAS,0065,76630,76071,Bellengreville,76,,,760710000B0622,,,,,,,,,,,,,0,1,Maison,70,3,S,sols,,,881,1.231773,49.903714
2020-1075248,2020-09-16,000001,Echange,183621,,,MONT SAINT BERNARD,B017,76630,76071,Bellengreville,76,,,760710000B0217,,,,,,,,,,,,,0,,,,,L,landes,,,960,1.229378,49.896478
2020-1075248,2020-09-16,000001,Echange,183621,,,MONT SAINT BERNARD,B017,76630,76071,Bellengreville,76,,,760710000B0386,,,,,,,,,,,,,0,,,,,P,prés,,,64028,1.229096,49.895786
2020-1075248,2020-09-16,000001,Echange,183621,,,MONT SAINT BERNARD,B017,76630,76071,Bellengreville,76,,,760710000B0387,,,,,,,,,,,,,0,,,,,L,landes,,,8000,1.229291,49.895725
2020-1075387,2020-10-13,000001,Vente,100000,5077,,BOURG DE BELLENGREVILLE,B006,76630,76071,Bellengreville,76,,,760710000B0585,,,,,,,,,,,,,0,1,Maison,72,4,VE,vergers,,,342,1.21526,49.906366
2020-1075387,2020-10-13,000001,Vente,100000,5077,,BOURG DE BELLENGREVILLE,B006,76630,76071,Bellengreville,76,,,760710000B0585,,,,,,,,,,,,,0,3,Dépendance,,0,P,prés,,,492,1.21526,49.906366
2020-1075387,2020-10-13,000001,Vente,100000,5077,,BOURG DE BELLENGREVILLE,B006,76630,76071,Bellengreville,76,,,760710000B0585,,,,,,,,,,,,,0,1,Maison,72,4,P,prés,,,492,1.21526,49.906366
2020-1075387,2020-10-13,000001,Vente,100000,5077,,BOURG DE BELLENGREVILLE,B006,76630,76071,Bellengreville,76,,,760710000B0585,,,,,,,,,,,,,0,3,Dépendance,,0,VE,vergers,,,342,1.21526,49.906366
2020-1075387,2020-10-13,000001,Vente,100000,5077,,BOURG DE BELLENGREVILLE,B006,76630,76071,Bellengreville,76,,,760710000B0585,,,,,,,,,,,,,0,3,Dépendance,,0,S,sols,,,535,1.21526,49.906366
2020-1075387,2020-10-13,000001,Vente,100000,5077,,BOURG DE BELLENGREVILLE,B006,76630,76071,Bellengreville,76,,,760710000B0585,,,,,,,,,,,,,0,1,Maison,72,4,S,sols,,,535,1.21526,49.906366
2020-1075498,2020-10-23,000001,Vente,355350,5026,,BOURG DE BELLENGREVILLE,B006,76630,76071,Bellengreville,76,,,760710000B0614,,,,,,,,,,,,,0,1,Maison,80,3,S,sols,,,227,1.232482,49.902434
2020-1075498,2020-10-23,000001,Vente,355350,5026,,BOURG DE BELLENGREVILLE,B006,76630,76071,Bellengreville,76,,,760710000B0614,,,,,,,,,,,,,0,3,Dépendance,,0,S,sols,,,227,1.232482,49.902434
2020-1075498,2020-10-23,000001,Vente,355350,5026,,BOURG DE BELLENGREVILLE,B006,76630,76071,Bellengreville,76,,,760710000B0614,,,,,,,,,,,,,0,2,Appartement,72,3,S,sols,,,227,1.232482,49.902434
2020-1075498,2020-10-23,000001,Vente,355350,5026,,BOURG DE BELLENGREVILLE,B006,76630,76071,Bellengreville,76,,,760710000B0614,,,,,,,,,,,,,0,1,Maison,72,3,S,sols,,,227,1.232482,49.902434
2020-1075498,2020-10-23,000001,Vente,355350,5026,,BOURG DE BELLENGREVILLE,B006,76630,76071,Bellengreville,76,,,760710000B0614,,,,,,,,,,,,,0,1,Maison,145,6,S,sols,,,227,1.232482,49.902434
2020-1075498,2020-10-23,000001,Vente,355350,5026,,BOURG DE BELLENGREVILLE,B006,76630,76071,Bellengreville,76,,,760710000B0614,,,,,,,,,,,,,0,3,Dépendance,,0,VE,vergers,,,3849,1.232482,49.902434
2020-1075498,2020-10-23,000001,Vente,355350,5026,,BOURG DE BELLENGREVILLE,B006,76630,76071,Bellengreville,76,,,760710000B0614,,,,,,,,,,,,,0,1,Maison,80,3,VE,vergers,,,3849,1.232482,49.902434
2020-1075498,2020-10-23,000001,Vente,355350,5026,,BOURG DE BELLENGREVILLE,B006,76630,76071,Bellengreville,76,,,760710000B0614,,,,,,,,,,,,,0,2,Appartement,72,3,VE,vergers,,,3849,1.232482,49.902434
2020-1075498,2020-10-23,000001,Vente,355350,5026,,BOURG DE BELLENGREVILLE,B006,76630,76071,Bellengreville,76,,,760710000B0614,,,,,,,,,,,,,0,1,Maison,72,3,VE,vergers,,,3849,1.232482,49.902434
2020-1075498,2020-10-23,000001,Vente,355350,5026,,BOURG DE BELLENGREVILLE,B006,76630,76071,Bellengreville,76,,,760710000B0614,,,,,,,,,,,,,0,1,Maison,145,6,VE,vergers,,,3849,1.232482,49.902434
2020-1075853,2020-11-27,000001,Vente,136000,736,,RTE DE SAINT SULPICE,0160,76630,76071,Bellengreville,76,,,760710000B0508,,,,,,,,,,,,,0,1,Maison,84,4,S,sols,,,500,1.228222,49.90445
2020-1075853,2020-11-27,000001,Vente,136000,736,,RTE DE SAINT SULPICE,0160,76630,76071,Bellengreville,76,,,760710000B0508,,,,,,,,,,,,,0,1,Maison,84,4,AG,terrains d'agrément,,,582,1.228222,49.90445
2020-1076035,2020-12-16,000001,Vente,170000,9001,,RUE DE SAINT GERMAIN,0145,76630,76071,Bellengreville,76,,,760710000B0540,,,,,,,,,,,,,0,1,Maison,100,5,VE,vergers,,,300,1.214927,49.905974
2020-1076035,2020-12-16,000001,Vente,170000,9001,,RUE DE SAINT GERMAIN,0145,76630,76071,Bellengreville,76,,,760710000B0540,,,,,,,,,,,,,0,1,Maison,100,5,S,sols,,,500,1.214927,49.905974
2020-1076155,2020-12-30,000001,Vente,85500,421,,RTE DE SAINT SULPICE,0160,76630,76071,Bellengreville,76,,,76071000ZC0074,,,,,,,,,,,,,0,1,Maison,147,4,S,sols,,,1450,1.224759,49.906433
