id_mutation,date_mutation,numero_disposition,nature_mutation,valeur_fonciere,adresse_numero,adresse_suffixe,adresse_nom_voie,adresse_code_voie,code_postal,code_commune,nom_commune,code_departement,ancien_code_commune,ancien_nom_commune,id_parcelle,ancien_id_parcelle,numero_volume,lot1_numero,lot1_surface_carrez,lot2_numero,lot2_surface_carrez,lot3_numero,lot3_surface_carrez,lot4_numero,lot4_surface_carrez,lot5_numero,lot5_surface_carrez,nombre_lots,code_type_local,type_local,surface_reelle_bati,nombre_pieces_principales,code_nature_culture,nature_culture,code_nature_culture_speciale,nature_culture_speciale,surface_terrain,longitude,latitude
2020-1086622,2020-09-30,000001,Vente,225750,3,,RUE DE LA MAIRIE,0075,76450,76176,Clasville,76,,,761760000A0595,,,,,,,,,,,,,0,1,Maison,116,6,J,jardins,,,552,0.618555,49.788884
2020-1086622,2020-09-30,000001,Vente,225750,3,,RUE DE LA MAIRIE,0075,76450,76176,Clasville,76,,,761760000A0595,,,,,,,,,,,,,0,1,Maison,116,6,S,sols,,,500,0.618555,49.788884
2020-1086723,2020-11-05,000001,Vente,304500,18,,RUE DU LAC,0062,76450,76176,Clasville,76,,,761760000A0565,,,,,,,,,,,,,0,1,Maison,90,4,AG,terrains d'agrément,,,796,0.632337,49.794512
2020-1086745,2020-11-02,000001,Vente,221200,,,LA PETITE COTE,B009,76450,76176,Clasville,76,,,761760000A0434,,,,,,,,,,,,,0,,,,,AG,terrains d'agrément,,,184,0.631716,49.787808
2020-1086745,2020-11-02,000001,Vente,221200,6,,LA PETITE COTE,B009,76450,76176,Clasville,76,,,761760000A0650,,,,,,,,,,,,,0,1,Maison,115,5,AG,terrains d'agrément,,,896,0.631794,49.787672
2020-1086745,2020-11-02,000001,Vente,221200,6,,LA PETITE COTE,B009,76450,76176,Clasville,76,,,761760000A0650,,,,,,,,,,,,,0,1,Maison,115,5,S,sols,,,500,0.631794,49.787672
2020-1086935,2020-11-27,000001,Vente,158000,,,LE VILLAGE,B014,76450,76176,Clasville,76,,,761760000A0386,,,,,,,,,,,,,0,,,,,VE,vergers,CIDRE,Cidre,1104,0.617097,49.788422
2020-1086935,2020-11-27,000001,Vente,158000,2,,GRANDE RUE,0045,76450,76176,Clasville,76,,,761760000A0652,,,,,,,,,,,,,0,1,Maison,67,2,S,sols,,,505,0.617077,49.788691
2020-1086935,2020-11-27,000001,Vente,158000,2,,GRANDE RUE,0045,76450,76176,Clasville,76,,,761760000A0653,,,,,,,,,,,,,0,,,,,S,sols,,,40,0.617142,49.788364
