id_mutation,date_mutation,numero_disposition,nature_mutation,valeur_fonciere,adresse_numero,adresse_suffixe,adresse_nom_voie,adresse_code_voie,code_postal,code_commune,nom_commune,code_departement,ancien_code_commune,ancien_nom_commune,id_parcelle,ancien_id_parcelle,numero_volume,lot1_numero,lot1_surface_carrez,lot2_numero,lot2_surface_carrez,lot3_numero,lot3_surface_carrez,lot4_numero,lot4_surface_carrez,lot5_numero,lot5_surface_carrez,nombre_lots,code_type_local,type_local,surface_reelle_bati,nombre_pieces_principales,code_nature_culture,nature_culture,code_nature_culture_speciale,nature_culture_speciale,surface_terrain,longitude,latitude
2020-1143800,2020-02-10,000001,Vente,105000,,,LE BOURG,B017,79100,79161,Luzay,79,,,79161000AI0223,,,,,,,,,,,,,0,,,,,T,terres,,,370,-0.197743,46.925238
2020-1143800,2020-02-10,000001,Vente,105000,1,,RUE CLEMENT CRECHET,0025,79100,79161,Luzay,79,,,79161000AI0292,,,,,,,,,,,,,0,1,Maison,102,4,S,sols,,,880,-0.197622,46.925066
2020-1143800,2020-02-10,000001,Vente,105000,,,LES ARDILLONS,B002,79100,79161,Luzay,79,,,79161000ZM0048,,,,,,,,,,,,,0,,,,,T,terres,,,670,-0.199353,46.927228
2020-1144276,2020-02-28,000001,Vente,1000,,,LE BAS VILLAIN SUD,B005,79100,79161,Luzay,79,,,79161000AM0098,,,,,,,,,,,,,0,,,,,S,sols,,,104,-0.215191,46.916271
2020-1144276,2020-02-28,000001,Vente,1000,,,LE BAS VILLAIN SUD,B005,79100,79161,Luzay,79,,,79161000AM0099,,,,,,,,,,,,,0,,,,,T,terres,,,798,-0.215649,46.916427
2020-1144276,2020-02-28,000001,Vente,1000,,,LE BAS VILLAIN SUD,B005,79100,79161,Luzay,79,,,79161000AM0100,,,,,,,,,,,,,0,,,,,T,terres,,,592,-0.21546,46.916463
2020-1144784,2020-03-13,000001,Vente,2750,,,LA MALINERIE,B100,79100,79161,Luzay,79,,,79161000AR0044,,,,,,,,,,,,,0,,,,,BT,taillis simples,,,1159,-0.266083,46.917604
2020-1144784,2020-03-13,000001,Vente,2750,,,LA MALINERIE,B100,79100,79161,Luzay,79,,,79161000AR0045,,,,,,,,,,,,,0,,,,,T,terres,,,5699,-0.265412,46.917788
2020-1144784,2020-03-13,000001,Vente,2750,,,LA MALINERIE,B100,79100,79161,Luzay,79,,,79161000AR0046,,,,,,,,,,,,,0,,,,,T,terres,,,821,-0.265074,46.918047
2020-1144784,2020-03-13,000001,Vente,2750,,,LA MALINERIE,B100,79100,79161,Luzay,79,,,79161000AR0047,,,,,,,,,,,,,0,,,,,T,terres,,,1825,-0.264906,46.918054
2020-1144784,2020-03-13,000001,Vente,2750,,,LA MALINERIE,B100,79100,79161,Luzay,79,,,79161000AR0048,,,,,,,,,,,,,0,,,,,T,terres,,,2975,-0.26474,46.918092
2020-1144911,2020-03-16,000001,Vente,94000,,,LA VALLEE DU CHAMP GUIEN,B152,79100,79161,Luzay,79,,,79161000AL0099,,,,,,,,,,,,,0,,,,,BT,taillis simples,,,1142,-0.207502,46.91835
2020-1144911,2020-03-16,000001,Vente,94000,,,LA VALLEE DU CHAMP GUIEN,B152,79100,79161,Luzay,79,,,79161000AL0104,,,,,,,,,,,,,0,,,,,BT,taillis simples,,,1334,-0.207614,46.917285
2020-1144911,2020-03-16,000001,Vente,94000,,,LES RIVIERES,B134,79100,79161,Luzay,79,,,79161000AL0262,,,,,,,,,,,,,0,,,,,BP,peupleraies,,,122,-0.202596,46.915769
2020-1144911,2020-03-16,000001,Vente,94000,,,LES RIVIERES,B134,79100,79161,Luzay,79,,,79161000AL0293,,,,,,,,,,,,,0,,,,,BP,peupleraies,,,271,-0.201939,46.915886
2020-1144911,2020-03-16,000001,Vente,94000,,,LES RIVIERES,B134,79100,79161,Luzay,79,,,79161000AL0296,,,,,,,,,,,,,0,,,,,BP,peupleraies,,,113,-0.202148,46.916093
2020-1144911,2020-03-16,000001,Vente,94000,,,LES BOIS DU PLATS,B016,79100,79161,Luzay,79,,,79161000AL0648,,,,,,,,,,,,,0,,,,,BT,taillis simples,,,290,-0.207836,46.916992
2020-1144911,2020-03-16,000001,Vente,94000,19,,RUE DES FORGERONS,0065,79100,79161,Luzay,79,,,79161000AM0354,,,,,,,,,,,,,0,1,Maison,110,4,S,sols,,,1133,-0.214621,46.915709
2020-1144911,2020-03-16,000001,Vente,94000,,,LE CHAMP GAT,B034,79100,79161,Luzay,79,,,79161000ZL0026,,,,,,,,,,,,,0,,,,,BT,taillis simples,,,409,-0.21999,46.918889
2020-1144911,2020-03-16,000001,Vente,94000,,,LES CHATAIGNERES,B049,79100,79161,Luzay,79,,,79161000ZL0083,,,,,,,,,,,,,0,,,,,T,terres,,,2800,-0.214812,46.919662
2020-1145090,2020-04-24,000001,Vente,12012,8,B,RUE DE LA THIBAUDIERE,0160,79100,79161,Luzay,79,,,79161000AO0234,,,,,,,,,,,,,0,,,,,AB,terrains a bâtir,,,1001,-0.221275,46.923406
2020-1145425,2020-05-15,000001,Vente,500,,,LA ROCHE,B135,79100,79161,Luzay,79,,,79161000AL0439,,,,,,,,,,,,,0,,,,,S,sols,,,198,-0.192068,46.914434
2020-1145425,2020-05-15,000001,Vente,500,,,LA ROCHE,B135,79100,79161,Luzay,79,,,79161000AL0440,,,,,,,,,,,,,0,,,,,J,jardins,,,289,-0.192208,46.914314
2020-1145676,2020-05-18,000001,Vente,100000,2,,RUE DE L AUMONERIE,0005,79100,79161,Luzay,79,,,79161000AH0007,,,,,,,,,,,,,0,1,Maison,132,3,S,sols,,,5921,-0.191541,46.91466
2020-1145676,2020-05-18,000001,Vente,100000,,,LA ROCHE,B135,79100,79161,Luzay,79,,,79161000AH0008,,,,,,,,,,,,,0,,,,,T,terres,,,1906,-0.191157,46.915119
2020-1145676,2020-05-18,000001,Vente,100000,,,LA ROCHE,B135,79100,79161,Luzay,79,,,79161000AH0009,,,,,,,,,,,,,0,,,,,T,terres,,,9138,-0.191948,46.915485
2020-1145897,2020-05-28,000001,Vente,3500,14,,RUE CLEMENT CRECHET,0025,79100,79161,Luzay,79,,,79161000AI0086,,,,,,,,,,,,,0,3,Dépendance,,0,S,sols,,,180,-0.194995,46.923495
2020-1146346,2020-06-19,000001,Vente,230.4,,,LES PATIS LONGS,B111,79100,79161,Luzay,79,,,79161000AV0097,,,,,,,,,,,,,0,,,,,T,terres,,,768,-0.222037,46.939128
2020-1146817,2020-06-30,000001,Vente,41256.9,,,LA ROUANCHE,B138,79100,79161,Luzay,79,,,79161000AR0035,,,,,,,,,,,,,0,,,,,BT,taillis simples,,,842,-0.257132,46.920972
2020-1146817,2020-06-30,000001,Vente,41256.9,,,LA ROUANCHE,B138,79100,79161,Luzay,79,,,79161000AR0036,,,,,,,,,,,,,0,,,,,T,terres,,,57388,-0.260054,46.921223
2020-1146817,2020-06-30,000001,Vente,41256.9,,,LA ROUANCHE,B138,79100,79161,Luzay,79,,,79161000AR0036,,,,,,,,,,,,,0,,,,,VI,vignes,,,2062,-0.260054,46.921223
2020-1146817,2020-06-30,000001,Vente,41256.9,,,LA ROUANCHE,B138,79100,79161,Luzay,79,,,79161000AR0037,,,,,,,,,,,,,0,,,,,BT,taillis simples,,,1980,-0.261603,46.9217
2020-1146817,2020-06-30,000001,Vente,41256.9,,,LA ROUANCHE,B138,79100,79161,Luzay,79,,,79161000AR0038,,,,,,,,,,,,,0,,,,,P,prés,,,4640,-0.25824,46.920485
2020-1146817,2020-06-30,000001,Vente,41256.9,,,LA ROUANCHE,B138,79100,79161,Luzay,79,,,79161000AR0038,,,,,,,,,,,,,0,,,,,P,prés,,,4641,-0.25824,46.920485
2020-1146817,2020-06-30,000001,Vente,41256.9,,,LA ROUANCHE,B138,79100,79161,Luzay,79,,,79161000AR0039,,,,,,,,,,,,,0,,,,,P,prés,,,7185,-0.258692,46.920061
2020-1146817,2020-06-30,000001,Vente,41256.9,,,LA ROUANCHE,B138,79100,79161,Luzay,79,,,79161000AR0039,,,,,,,,,,,,,0,,,,,P,prés,,,7185,-0.258692,46.920061
2020-1146817,2020-06-30,000001,Vente,41256.9,,,LA ROUANCHE,B138,79100,79161,Luzay,79,,,79161000AR0041,,,,,,,,,,,,,0,,,,,P,prés,,,2167,-0.260522,46.919997
2020-1146817,2020-06-30,000001,Vente,41256.9,,,LA ROUANCHE,B138,79100,79161,Luzay,79,,,79161000AR0041,,,,,,,,,,,,,0,,,,,P,prés,,,2166,-0.260522,46.919997
2020-1146817,2020-06-30,000001,Vente,41256.9,,,LA MALINERIE,B100,79100,79161,Luzay,79,,,79161000AR0051,,,,,,,,,,,,,0,,,,,T,terres,,,8445,-0.263774,46.91866
2020-1147217,2020-07-09,000001,Vente,170000,,,LE CHILLAS,B051,79100,79161,Luzay,79,,,79161000AM0079,,,,,,,,,,,,,0,,,,,J,jardins,,,513,-0.212032,46.915984
2020-1147217,2020-07-09,000001,Vente,170000,,,LE CHILLAS,B051,79100,79161,Luzay,79,,,79161000AM0320,,,,,,,,,,,,,0,,,,,J,jardins,,,12,-0.212386,46.915577
2020-1147217,2020-07-09,000001,Vente,170000,9,,RUE DES FORGERONS,0065,79100,79161,Luzay,79,,,79161000AM0321,,,,,,,,,,,,,0,1,Maison,248,8,S,sols,,,385,-0.212235,46.915776
2020-1147217,2020-07-09,000001,Vente,170000,,,LE CHILLAS,B051,79100,79161,Luzay,79,,,79161000AM0323,,,,,,,,,,,,,0,,,,,S,sols,,,1568,-0.212123,46.915747
2020-1147217,2020-07-09,000001,Vente,170000,,,LE CHILLAS,B051,79100,79161,Luzay,79,,,79161000AM0325,,,,,,,,,,,,,0,,,,,T,terres,,,992,-0.211621,46.915731
2020-1147217,2020-07-09,000001,Vente,170000,,,LE CHILLAS,B051,79100,79161,Luzay,79,,,79161000AM0325,,,,,,,,,,,,,0,,,,,T,terres,,,993,-0.211621,46.915731
2020-1147217,2020-07-09,000001,Vente,170000,,,LE CHILLAS,B051,79100,79161,Luzay,79,,,79161000AM0327,,,,,,,,,,,,,0,,,,,S,sols,,,527,-0.211346,46.915463
2020-1148670,2020-08-28,000001,Vente,1200,,,LE BOURG,B017,79100,79161,Luzay,79,,,79161000AI0165,,,,,,,,,,,,,0,,,,,T,terres,,,3217,-0.196294,46.925229
2020-1148670,2020-08-28,000001,Vente,1200,,,LES MOULINS A VENT,B105,79100,79161,Luzay,79,,,79161000AK0059,,,,,,,,,,,,,0,,,,,T,terres,,,1169,-0.200506,46.924128
2020-1148670,2020-08-28,000001,Vente,1200,,,LES MOULINS A VENT,B105,79100,79161,Luzay,79,,,79161000AK0077,,,,,,,,,,,,,0,,,,,T,terres,,,1356,-0.200189,46.922915
2020-1148670,2020-08-28,000001,Vente,1200,,,LES MOULINS A VENT,B105,79100,79161,Luzay,79,,,79161000AK0077,,,,,,,,,,,,,0,,,,,T,terres,,,2710,-0.200189,46.922915
2020-1148820,2020-08-25,000001,Vente,32700,25,,CHEM DE ST HILAIRE,0148,79100,79161,Luzay,79,,,79161000AL0934,,,,,,,,,,,,,0,1,Maison,100,5,S,sols,,,160,-0.208756,46.913369
2020-1148820,2020-08-25,000001,Vente,32700,,,VOLBINE,B161,79100,79161,Luzay,79,,,79161000AL0936,,,,,,,,,,,,,0,,,,,BT,taillis simples,,,492,-0.20878,46.913508
2020-1148822,2020-08-25,000001,Vente,70100,27,,CHEM DE ST HILAIRE,0148,79100,79161,Luzay,79,,,79161000AL0935,,,,,,,,,,,,,0,1,Maison,80,5,S,sols,,,240,-0.208642,46.913334
2020-1148822,2020-08-25,000001,Vente,70100,,,VOLBINE,B161,79100,79161,Luzay,79,,,79161000AL0937,,,,,,,,,,,,,0,,,,,BT,taillis simples,,,817,-0.2084,46.913413
2020-1149248,2020-09-22,000001,Vente,130000,6,,RUE CLEMENT CRECHET,0025,79100,79161,Luzay,79,,,79161000AI0189,,,,,,,,,,,,,0,,,,,S,sols,,,427,-0.196368,46.923981
2020-1149248,2020-09-22,000001,Vente,130000,6,,RUE CLEMENT CRECHET,0025,79100,79161,Luzay,79,,,79161000AI0203,,,,,,,,,,,,,0,1,Maison,173,5,S,sols,,,581,-0.196331,46.924114
2020-1150518,2020-10-27,000001,Vente,600,,,LE CHILLAS,B051,79100,79161,Luzay,79,,,79161000AM0054,,,,,,,,,,,,,0,,,,,J,jardins,,,30,-0.213209,46.91581
2020-1150518,2020-10-27,000001,Vente,600,,,LE CHILLAS,B051,79100,79161,Luzay,79,,,79161000AM0057,,,,,,,,,,,,,0,,,,,J,jardins,,,323,-0.213059,46.915589
2020-1150575,2020-10-21,000001,Vente,109900,21,,RUE DU PANORAMA,0115,79100,79161,Luzay,79,,,79161000AC0032,,,,,,,,,,,,,0,1,Maison,101,6,S,sols,,,1320,-0.192348,46.926474
2020-1150575,2020-10-21,000001,Vente,109900,21,,RUE DU PANORAMA,0115,79100,79161,Luzay,79,,,79161000AC0032,,,,,,,,,,,,,0,1,Maison,101,6,BT,taillis simples,,,2760,-0.192348,46.926474
2020-1150591,2020-10-30,000001,Vente,148800,1,,IMP DE LA VIGILANTE,0180,79100,79161,Luzay,79,,,79161000AI0096,,,,,,,,,,,,,0,1,Maison,148,8,S,sols,,,1108,-0.19562,46.922556
2020-1150591,2020-10-30,000001,Vente,148800,,,LE BOURG,B017,79100,79161,Luzay,79,,,79161000AI0130,,,,,,,,,,,,,0,,,,,J,jardins,,,340,-0.195408,46.922361
2020-1151044,2020-11-09,000001,Vente,48000,5,,LA MALINERIE,B100,79100,79161,Luzay,79,,,79161000AR0052,,,,,,,,,,,,,0,1,Maison,88,4,S,sols,,,846,-0.263559,46.917729
2020-1151044,2020-11-09,000001,Vente,48000,,,LA MALINERIE,B100,79100,79161,Luzay,79,,,79161000AR0053,,,,,,,,,,,,,0,,,,,S,sols,,,1144,-0.263327,46.917747
2020-1151044,2020-11-09,000001,Vente,48000,,,LA MALINERIE,B100,79100,79161,Luzay,79,,,79161000AR0082,,,,,,,,,,,,,0,,,,,T,terres,,,1000,-0.263777,46.917738
2020-1151112,2020-11-20,000001,Vente,125000,,,LA TONNELLE DES GRIPPES,B145,79100,79161,Luzay,79,,,79161000AL0560,,,,,,,,,,,,,0,,,,,BT,taillis simples,,,1540,-0.205783,46.915723
2020-1151112,2020-11-20,000001,Vente,125000,,,LES BOIS DU PLATS,B016,79100,79161,Luzay,79,,,79161000AL0667,,,,,,,,,,,,,0,,,,,BT,taillis simples,,,210,-0.210664,46.917141
2020-1151112,2020-11-20,000001,Vente,125000,,,LES BOIS DU PLATS,B016,79100,79161,Luzay,79,,,79161000AL0700,,,,,,,,,,,,,0,,,,,BT,taillis simples,,,116,-0.213725,46.917689
2020-1151112,2020-11-20,000001,Vente,125000,,,LES BOIS DU PLATS,B016,79100,79161,Luzay,79,,,79161000AL0704,,,,,,,,,,,,,0,,,,,BT,taillis simples,,,740,-0.213602,46.917992
2020-1151112,2020-11-20,000001,Vente,125000,,,LES BOIS DU PLATS,B016,79100,79161,Luzay,79,,,79161000AL0872,,,,,,,,,,,,,0,,,,,BT,taillis simples,,,2920,-0.21273,46.916645
2020-1151112,2020-11-20,000001,Vente,125000,,,LE CHILLAS,B051,79100,79161,Luzay,79,,,79161000AM0064,,,,,,,,,,,,,0,,,,,BT,taillis simples,,,2261,-0.213352,46.914451
2020-1151112,2020-11-20,000001,Vente,125000,,,LE CHILLAS,B051,79100,79161,Luzay,79,,,79161000AM0084,,,,,,,,,,,,,0,,,,,T,terres,,,1892,-0.213315,46.916729
2020-1151112,2020-11-20,000001,Vente,125000,,,LE CHILLAS,B051,79100,79161,Luzay,79,,,79161000AM0084,,,,,,,,,,,,,0,,,,,T,terres,,,1893,-0.213315,46.916729
2020-1151112,2020-11-20,000001,Vente,125000,10,,RUE DES FORGERONS,0065,79100,79161,Luzay,79,,,79161000AM0305,,,,,,,,,,,,,0,1,Maison,84,4,S,sols,,,920,-0.213037,46.916141
2020-1151124,2020-11-16,000001,Vente,158700,1,,CHEM DE ST HILAIRE,0148,79100,79161,Luzay,79,,,79161000AM0331,,,,,,,,,,,,,0,1,Maison,160,7,S,sols,,,433,-0.217203,46.915248
2020-1151728,2020-12-07,000001,Vente,44000,20,,RTE DE PARTHENAY,0120,79100,79161,Luzay,79,,,79161000ZK0055,,,,,,,,,,,,,0,1,Maison,72,4,S,sols,,,383,-0.197261,46.920376
2020-1151728,2020-12-07,000001,Vente,44000,20,,RTE DE PARTHENAY,0120,79100,79161,Luzay,79,,,79161000ZK0055,,,,,,,,,,,,,0,1,Maison,72,4,T,terres,,,667,-0.197261,46.920376
2020-1152171,2020-11-25,000001,Vente,17125,,,BOIS DE LUZAY,B013,79100,79161,Luzay,79,,,79161000AC0022,,,,,,,,,,,,,0,,,,,BT,taillis simples,,,4062,-0.194254,46.92604
2020-1152171,2020-11-25,000001,Vente,17125,,,PRE DE ROUILLE,B127,79100,79161,Luzay,79,,,79161000AC0100,,,,,,,,,,,,,0,,,,,P,prés,,,1530,-0.188831,46.925079
2020-1152171,2020-11-25,000001,Vente,17125,,,PRE DE ROUILLE,B127,79100,79161,Luzay,79,,,79161000AC0104,,,,,,,,,,,,,0,,,,,P,prés,,,2400,-0.188311,46.924284
2020-1152171,2020-11-25,000001,Vente,17125,,,LES PLANTES,B123,79100,79161,Luzay,79,,,79161000AH0079,,,,,,,,,,,,,0,,,,,BT,taillis simples,,,303,-0.183936,46.9179
2020-1152171,2020-11-25,000001,Vente,17125,,,LES VARANNES SUD,B158,79100,79161,Luzay,79,,,79161000AK0014,,,,,,,,,,,,,0,,,,,T,terres,,,3411,-0.205544,46.923937
2020-1152171,2020-11-25,000001,Vente,17125,,,LES VARANNES SUD,B158,79100,79161,Luzay,79,,,79161000AK0023,,,,,,,,,,,,,0,,,,,T,terres,,,1680,-0.204238,46.923861
2020-1152171,2020-11-25,000001,Vente,17125,,,LES VARANNES SUD,B158,79100,79161,Luzay,79,,,79161000AK0024,,,,,,,,,,,,,0,,,,,T,terres,,,1990,-0.204148,46.923938
2020-1152171,2020-11-25,000001,Vente,17125,,,LES MOULINS A VENT,B105,79100,79161,Luzay,79,,,79161000AK0092,,,,,,,,,,,,,0,,,,,L,landes,,,812,-0.198373,46.922435
2020-1152171,2020-11-25,000001,Vente,17125,,,LES MOULINS A VENT,B105,79100,79161,Luzay,79,,,79161000AK0128,,,,,,,,,,,,,0,,,,,T,terres,,,782,-0.202442,46.922035
2020-1152171,2020-11-25,000001,Vente,17125,,,LES MOULINS A VENT,B105,79100,79161,Luzay,79,,,79161000AK0129,,,,,,,,,,,,,0,,,,,T,terres,,,1219,-0.202502,46.922184
2020-1152171,2020-11-25,000001,Vente,17125,,,LES MOULINS A VENT,B105,79100,79161,Luzay,79,,,79161000AK0184,,,,,,,,,,,,,0,,,,,VE,vergers,FAMIL,Familial (jardin),648,-0.197965,46.921699
2020-1152171,2020-11-25,000001,Vente,17125,,,LES MOULINS A VENT,B105,79100,79161,Luzay,79,,,79161000AK0187,,,,,,,,,,,,,0,,,,,T,terres,,,94,-0.197652,46.922032
2020-1152171,2020-11-25,000001,Vente,17125,,,LES MOULINS A VENT,B105,79100,79161,Luzay,79,,,79161000AK0209,,,,,,,,,,,,,0,,,,,T,terres,,,515,-0.197835,46.922917
2020-1152171,2020-11-25,000001,Vente,17125,,,LES MOULINS A VENT,B105,79100,79161,Luzay,79,,,79161000AK0223,,,,,,,,,,,,,0,,,,,T,terres,,,1609,-0.197705,46.922148
2020-1152171,2020-11-25,000001,Vente,17125,,,LA VALLEE DU CHAMP GUIEN,B152,79100,79161,Luzay,79,,,79161000AL0016,,,,,,,,,,,,,0,,,,,BT,taillis simples,,,1136,-0.210417,46.920771
2020-1152171,2020-11-25,000001,Vente,17125,,,LA VALLEE DU CHAMP GUIEN,B152,79100,79161,Luzay,79,,,79161000AL0020,,,,,,,,,,,,,0,,,,,BT,taillis simples,,,293,-0.20993,46.920407
2020-1152171,2020-11-25,000001,Vente,17125,,,LA VALLEE DU CHAMP GUIEN,B152,79100,79161,Luzay,79,,,79161000AL0043,,,,,,,,,,,,,0,,,,,BT,taillis simples,,,601,-0.209789,46.919741
2020-1152171,2020-11-25,000001,Vente,17125,,,LA VALLEE DU CHAMP GUIEN,B152,79100,79161,Luzay,79,,,79161000AL0154,,,,,,,,,,,,,0,,,,,BT,taillis simples,,,591,-0.207718,46.919757
2020-1152171,2020-11-25,000001,Vente,17125,,,LA VALLEE DU CHAMP GUIEN,B152,79100,79161,Luzay,79,,,79161000AL0168,,,,,,,,,,,,,0,,,,,BT,taillis simples,,,1084,-0.204511,46.918812
2020-1152171,2020-11-25,000001,Vente,17125,,,LE BOIS DU GLAND,B015,79100,79161,Luzay,79,,,79161000AN0050,,,,,,,,,,,,,0,,,,,T,terres,,,1492,-0.211684,46.9267
2020-1152171,2020-11-25,000001,Vente,17125,,,LE BOIS DU GLAND,B015,79100,79161,Luzay,79,,,79161000AN0050,,,,,,,,,,,,,0,,,,,T,terres,,,2983,-0.211684,46.9267
2020-1152171,2020-11-25,000001,Vente,17125,,,PIRLAIS,B120,79100,79161,Luzay,79,,,79161000ZB0061,,,,,,,,,,,,,0,,,,,T,terres,,,3320,-0.19652,46.93502
2020-1152171,2020-11-25,000001,Vente,17125,,,LA CROIX DES NEDES,B070,79100,79161,Luzay,79,,,79161000ZD0084,,,,,,,,,,,,,0,,,,,T,terres,,,1670,-0.186836,46.929704
2020-1152171,2020-11-25,000001,Vente,17125,,,LA CROIX DES NEDES,B070,79100,79161,Luzay,79,,,79161000ZD0085,,,,,,,,,,,,,0,,,,,BT,taillis simples,,,886,-0.187332,46.929573
2020-1152171,2020-11-25,000001,Vente,17125,,,LA CROIX DES NEDES,B070,79100,79161,Luzay,79,,,79161000ZD0102,,,,,,,,,,,,,0,,,,,BT,taillis simples,,,3750,-0.18949,46.931634
2020-1152171,2020-11-25,000001,Vente,17125,,,LA CROIX DES NEDES,B070,79100,79161,Luzay,79,,,79161000ZD0103,,,,,,,,,,,,,0,,,,,L,landes,,,4010,-0.189497,46.931761
2020-1152171,2020-11-25,000001,Vente,17125,,,LA CROIX DES NEDES,B070,79100,79161,Luzay,79,,,79161000ZD0105,,,,,,,,,,,,,0,,,,,T,terres,,,7820,-0.188453,46.932259
2020-1152171,2020-11-25,000001,Vente,17125,,,PIEDS DE GROLLE,B116,79100,79161,Luzay,79,,,79161000ZE0174,,,,,,,,,,,,,0,,,,,BT,taillis simples,,,294,-0.171257,46.922326
2020-1152171,2020-11-25,000001,Vente,17125,,,LE CHAMP RICHE,B037,79100,79161,Luzay,79,,,79161000ZK0016,,,,,,,,,,,,,0,,,,,T,terres,,,4140,-0.205672,46.923386
2020-1152171,2020-11-25,000001,Vente,17125,,,LE CHAMP GUIEN,B035,79100,79161,Luzay,79,,,79161000ZK0044,,,,,,,,,,,,,0,,,,,T,terres,,,3410,-0.207605,46.920962
2020-1152171,2020-11-25,000001,Vente,17125,,,LES GARDES,B084,79100,79161,Luzay,79,,,79161000ZK0053,,,,,,,,,,,,,0,,,,,T,terres,,,7080,-0.198052,46.920671
2020-1152171,2020-11-25,000001,Vente,17125,,,LE PRE NEUF,B128,79100,79161,Luzay,79,,,79161000ZK0084,,,,,,,,,,,,,0,,,,,T,terres,,,850,-0.19121,46.921256
2020-1152171,2020-11-25,000001,Vente,17125,,,LE PRE NEUF,B128,79100,79161,Luzay,79,,,79161000ZK0084,,,,,,,,,,,,,0,,,,,T,terres,,,850,-0.19121,46.921256
2020-1152171,2020-11-25,000001,Vente,17125,,,CHAMP BOISSEAU,B029,79100,79161,Luzay,79,,,79161000ZM0066,,,,,,,,,,,,,0,,,,,T,terres,,,17680,-0.206789,46.931029
2020-1152171,2020-11-25,000001,Vente,17125,,,LES CHAMPS BRULES,B038,79100,79161,Luzay,79,,,79161000ZM0091,,,,,,,,,,,,,0,,,,,T,terres,,,1800,-0.211452,46.926746
2020-1152171,2020-11-25,000001,Vente,17125,,,LES CHAMPS BRULES,B038,79100,79161,Luzay,79,,,79161000ZM0092,,,,,,,,,,,,,0,,,,,T,terres,,,1670,-0.211631,46.926651
2020-1152417,2020-12-16,000001,Vente,249000,7,,RUE DE LA GAMBARDERIE,0075,79100,79161,Luzay,79,,,79161000AO0061,,,,,,,,,,,,,0,1,Maison,260,7,S,sols,,,1824,-0.221989,46.925426
2020-1152417,2020-12-16,000001,Vente,249000,,,THIORS,B144,79100,79161,Luzay,79,,,79161000AO0226,,,,,,,,,,,,,0,,,,,J,jardins,,,1555,-0.222121,46.925737
2020-1152417,2020-12-16,000001,Vente,249000,,,THIORS,B144,79100,79161,Luzay,79,,,79161000AO0227,,,,,,,,,,,,,0,,,,,T,terres,,,1129,-0.2224,46.925401
